ERA vocabulary
type: Ontology
imports: geosparql#
license: https://creativecommons.org/licenses/by/4.0/
author: me
contributor: me
contributor: Edna Ruckhaus
contributor: Ivo Velitchkov
contributor: Marina Aguado
contributor: Oscar Corcho
contributor: Polymnia Vasilopoulou
contributor: Wouter Beek
issued: 2020-07-29
modified: 2022-09-05
publisher: European Union Agency for Railways
comment: This is the human and machine readable Vocabulary/Ontology governed by the European Union Agency for Railways. It represents the concepts and relationships linked to the sectorial legal framework and the use cases under the Agency´s remit. Currently, this vocabulary covers the European railway infrastructure and the vehicles authorized to operate over it. It is a semantic/browsable representation of the [RINF](https://www.era.europa.eu/sites/default/files/registers/docs/rinf_application_guide_for_register_en.pdf) and [ERATV](https://www.era.europa.eu/sites/default/files/registers/docs/iu-eratv_application_guide_for_register_2016-797_en.pdf) application guides that were built by domain experts in the RINF and ERATV working parties.
prior version: https://git.fpfis.eu/datateam/ERA/era-vocabulary/-/releases/v2.5.1
version info: v2.5.2
version URI: https://git.fpfis.eu/datateam/ERA/era-vocabulary/-/releases/v2.5.2

eratv index
type: AnnotationProperty
created: 2020-11-03
modified: 2020-11-03
comment: Index code used in the original definition of a parameter in ERATV.
term status: stable

rinf index
type: AnnotationProperty
created: 2020-11-03
modified: 2020-11-03
comment: Index code used in the original definition of a parameter in RINF.
term status: stable

routebook index
type: AnnotationProperty
comment: The index of a vocabulary term in Appendix D2 Elements the infrastructure manager has to provide to the railway undertaking for the Route Book from the document Commission Implementing Regulation (EU) 2019/773 of 16 May 2019 on the technical specification for interoperability relating to the operation and traffic management subsystem of the rail system within the European Union and repealing Decision 2012/757/EU.

altitude
type: AnnotationProperty
comment: The WGS84 altitude of a SpatialThing (decimal meters above the local reference ellipsoid).
domain: SpatialThing

latitude
type: AnnotationProperty
comment: The WGS84 latitude of a SpatialThing (decimal degrees).
domain: SpatialThing

location
type: AnnotationProperty
sub property of: based near
range: SpatialThing
type: ObjectProperty
is core parameter: true
comment: The relation between something and the point, or other geometrical thing in space, where it is. For example, the realtionship between a radio tower and a Point with a given lat and long. Or a relationship between a park and its outline as a closed arc of points, or a road and its location as a arc (a sequence of points). Clearly in practice there will be limit to the accuracy of any such statement, but one would expect an accuracy appropriate for the size of the object and uses such as mapping .

longitude
type: AnnotationProperty
comment: The WGS84 longitude of a SpatialThing (decimal degrees).
domain: SpatialThing

Existence and TSI compliance of rules for magnetic fields emitted by a vehicle
type: ObjectProperty
type: FunctionalProperty
domain: Track
range: Concept
rinf index: 1.1.1.3.9.1
created: 2021-08-09
modified: 2021-09-12
comment: Existence and TSI compliance of rules for magnetic fields emitted by a vehicle. The allowed values for this property belong to the SKOS Concept Scheme http://ontorail.org/src/ERA/era252/concepts/tsi-compliances/TSICompliances.
term status: stable

Existence and TSI compliance of limits in harmonics in the traction current of vehicles
type: ObjectProperty
type: FunctionalProperty
domain: Track
range: Concept
rinf index: 1.1.1.3.9.2
created: 2021-08-09
modified: 2021-09-12
comment: Existence and TSI compliance of limits in harmonics in the traction current of vehicles. The allowed values for this property belong to the SKOS Concept Scheme http://ontorail.org/src/ERA/era252/concepts/tsi-compliances/TSICompliances.
term status: stable

authorized country
type: ObjectProperty
domain: Vehicle Type
range: Concept
created: 2020-09-30
modified: 2020-09-30
comment: Indicates the country(ies) in where a vehicle type has been authorized to operate. The allowed values for this property belong to the SKOS Concept Scheme http://publications.europa.eu/resource/authority/country
term status: stable

axle bearing condition monitoring
type: ObjectProperty
domain: Vehicle Type
range: Concept
eratv index: 4.9.2
created: 2020-08-24
modified: 2021-08-02
comment: Axle bearing condition monitoring. The allowed values for this property belong to the SKOS Concept Scheme http://ontorail.org/src/ERA/era252/concepts/axle-monitoring/AxleBearingMonitoring
term status: stable

vehicle category
type: ObjectProperty
type: FunctionalProperty
domain: Vehicle Type
range: Concept
eratv index: 1.4
created: 2020-07-29
modified: 2021-08-03
comment: Vehicle category. The allowed values for this property belong to the SKOS Concept Scheme http://ontorail.org/src/ERA/era252/concepts/vehicle-types/Categories.
term status: stable

composed of
type: ObjectProperty
domain: Class
  union of: Gradient Curve
  union of: Speed Section
range: linear location
created: 2022-09-12
comment: The speed section and the gradient curve are composed of zero or more linear locations.
term status: stable

contact line system
type: ObjectProperty
domain: Track
range: Contact Line System
created: 2020-08-24
modified: 2021-09-11
comment: Contact line system present in the section of line.
term status: stable

Type of contact line system
type: ObjectProperty
domain: Contact Line System
range: Concept
is core parameter: true
rinf index: 1.1.1.2.2.1.1
created: 2021-08-06
modified: 2021-08-06
comment: Indication of the type of the contact line system. The allowed values for this property belong to the SKOS Concept Scheme http://ontorail.org/src/ERA/era252/concepts/contact-line-systems/ContactLineSystems
term status: stable

Permitted contact strip material
type: ObjectProperty
domain: Class
  union of: Track
  union of: Vehicle Type
range: Concept
eratv index: 4.10.10
rinf index: 1.1.1.2.3.4
created: 2020-08-25
modified: 2021-09-12
comment: Indication of which contact strip materials are permitted to be used. The allowed values for this property belong to the SKOS Concept Scheme http://ontorail.org/src/ERA/era252/concepts/contact-strip-materials/ContactStripMaterials
term status: stable

data GSM-R network
type: ObjectProperty
type: FunctionalProperty
domain: Vehicle Type
range: Concept
eratv index: 4.13.2.11
created: 2020-08-31
modified: 2021-08-02
comment: Data SIM Card GSM-R Home Network. The allowed values for this property belong to the SKOS Concept Scheme http://ontorail.org/src/ERA/era252/concepts/gsmr-networks/GSMRNetworks
term status: stable

Radio system compatibility data
type: ObjectProperty
domain: Class
  union of: Track
  union of: Vehicle Type
range: Concept
eratv index: 4.13.2.8
rinf index: 1.1.1.3.3.10
created: 2020-08-31
modified: 2021-09-12
comment: Radio requirements used for demonstrating technical compatibility voice. The allowed values for this property belong to the SKOS Concept Scheme http://ontorail.org/src/ERA/era252/concepts/data-radio-system-compatibilities/DataRadioSystemCompatibilities. This concept scheme is temporatily non-deferenceable.
term status: stable

Use of eddy current brakes
type: ObjectProperty
type: FunctionalProperty
domain: Track
range: Concept
is core parameter: true
rinf index: 1.1.1.1.6.2
created: 2020-08-24
modified: 2022-09-06
comment: Use of eddy current brakes. The allowed values for this property belong to the SKOS Concept Scheme http://ontorail.org/src/ERA/era252/concepts/eddy-current-braking/EddyCurrentBraking This property has been modified to be a RINF parameter (its eratvIndex is deleted). It is treated as a SKOS by RINF and as a boolean by ERATV. A new ERATV datatype property has been defined, eddyCurrentBrakingFitted with boolean values.
term status: stable

element A
type: ObjectProperty
domain: Net Relation
range: Net Element
created: 2021-04-01
modified: 2021-04-01
comment: References the first topological object in an oriented relation.
term status: stable

element B
type: ObjectProperty
domain: Net Relation
range: Net Element
created: 2021-04-01
modified: 2021-04-01
comment: References the second topological object in an oriented relation.
term status: stable

element part
type: ObjectProperty
domain: Net Element
range: Net Element
created: 2021-04-01
modified: 2021-04-01
comment: References the topology object of a higher-granularity level which contains a lower-granularity topology object.
term status: stable

end coupling type
type: ObjectProperty
domain: Vehicle Type
range: Concept
eratv index: 4.9.1
created: 2021-08-31
modified: 2021-08-31
comment: Type of end coupling (indicating tensile and compressive forces). The allowed values for this property belong to the SKOS Concept Scheme http://ontorail.org/src/ERA/era252/concepts/end-coupling-type/EndCouplingType.
term status: stable

End of tunnel
type: ObjectProperty
sub property of: hasGeometry
sub property of: location
domain: Tunnel
range: Class
  union of: Geometry
  union of: point
is core parameter: true
rinf index: 1.1.1.1.8.4
created: 2020-07-29
modified: 2021-08-11
comment: References the geolocation of the end of a tunnel.
term status: stable

Energy supply system
type: ObjectProperty
domain: Class
  union of: Contact Line System
  union of: Vehicle Type
range: Concept
eratv index: 4.10.1
is core parameter: true
rinf index: 1.1.1.2.2.1.2
created: 2020-08-24
modified: 2021-08-06
comment: Indication of the traction supply system (nominal voltage and frequency). Type of end coupling (indicating tensile and compressive forces). The allowed values for this property belong to the SKOS Concept Scheme http://ontorail.org/src/ERA/era252/concepts/energy-supply-systems/EnergySupplySystems
term status: stable

ETCS baseline
type: ObjectProperty
domain: Class
  union of: ETCS Level
  union of: Vehicle Type
range: Concept
eratv index: 4.13.1.2
rinf index: 1.1.1.3.2.2
created: 2021-08-07
modified: 2021-08-31
comment: ETCS baseline installed lineside/on-board. The allowed values for this property belong to the SKOS Concept Scheme http://ontorail.org/src/ERA/era252/concepts/etcs-baselines/ETCSBaselines
term status: stable

ETCS level for degraded situation
type: ObjectProperty
domain: Track
range: Concept
rinf index: 1.1.1.3.10.1
created: 2021-08-09
modified: 2021-09-12
comment: ERTMS / ETCS application level for degraded situation related to the track side equipment. The allowed values for this property belong to the SKOS Concept Scheme http://ontorail.org/src/ERA/era252/concepts/etcs-situation/ETCSSituations
term status: stable

ETCS equipment level
type: ObjectProperty
type: FunctionalProperty
domain: Vehicle Type
range: Concept
eratv index: 4.13.1.1
created: 2021-08-31
modified: 2021-08-31
comment: ETCS equipment on-board and its level. The allowed values for this property belong to the SKOS Concept Scheme http://ontorail.org/src/ERA/era252/concepts/etcs-equipment-on-board-level/ETCSEquipmentLevels.
term status: stable

ETCS infill installed lineside
type: ObjectProperty
type: FunctionalProperty
domain: Class
  union of: Track
  union of: Vehicle Type
range: Concept
eratv index: 4.13.1.3
rinf index: 1.1.1.3.2.4
created: 2021-08-08
modified: 2021-09-12
comment: Information about installed trackside/on-board equipment capable to transmit infill information by loop or GSM-R for level 1 installation. The allowed values for this property belong to the SKOS Concept Scheme http://ontorail.org/src/ERA/era252/concepts/etcs-infills/ETCSInfills
term status: stable

etcs level
type: ObjectProperty
domain: Track
range: ETCS Level
created: 2021-08-07
modified: 2021-09-12
comment: ETCS level available in the section of line. The allowed values for this property belong to the SKOS Concept Scheme http://ontorail.org/src/ERA/era252/concepts/etcs-levels/ETCSLevels
term status: stable

ETCS level type
type: ObjectProperty
domain: ETCS Level
range: Concept
is core parameter: true
rinf index: 1.1.1.3.2.1
created: 2021-08-07
modified: 2021-08-07
comment: ERTMS / ETCS application level which expresses the possible operating relationships between track and train. The allowed values for this property belong to the SKOS Concept Scheme http://ontorail.org/src/ERA/era252/concepts/etcs-levels/ETCSLevels
term status: stable

ETCS M_version
type: ObjectProperty
type: FunctionalProperty
domain: Track
range: Concept
rinf index: 1.1.1.3.2.10
created: 2021-08-08
modified: 2021-09-12
comment: ETCS M_version according to SRS 7.5.1.9. The allowed values for this property belong to the SKOS Concept Scheme http://ontorail.org/src/ERA/era252/concepts/etcs-m-versions/ETCSMVersions
term status: stable

ETCS system compatibility
type: ObjectProperty
domain: Class
  union of: Track
  union of: Vehicle Type
range: Concept
eratv index: 4.13.1.8
is core parameter: true
rinf index: 1.1.1.3.2.9
created: 2020-08-31
modified: 2021-09-12
comment: ETCS requirements used for demonstrating technical compatibility. The allowed values for this property belong to the SKOS Concept Scheme http://ontorail.org/src/ERA/era252/concepts/etcs-system-compatibilities/ETCSSystemCompatibilities
term status: stable

fire safety category
type: ObjectProperty
type: FunctionalProperty
domain: Vehicle Type
range: Concept
eratv index: 4.4.1
created: 2020-08-29
modified: 2021-08-03
comment: Fire safety category for tunnels. The allowed values for this property belong to the SKOS Concept Scheme http://ontorail.org/src/ERA/era252/concepts/rolling-stock-fire/Categories.
term status: stable

Part of a Railway freight corridor
type: ObjectProperty
domain: Track
range: Concept
rinf index: 1.1.1.1.2.3
rinf index: 1.2.1.0.2.3
created: 2021-08-03
modified: 2021-08-11
comment: Railway Freight Corridor that the line is designated to. Fire safety category for tunnels. The allowed values for this property belong to the SKOS Concept Scheme http://ontorail.org/src/ERA/era252/concepts/freight-corridor/FreightCorridors
term status: stable

Section with train detection limitation, only for the French network
type: ObjectProperty
domain: Track
range: Concept
rinf index: 1.1.1.3.7.1.4
created: 2020-08-24
modified: 2021-09-12
comment: Section with train detection limitation, specific for route compatibility check on French network. The allowed values for this property belong to the SKOS Concept Scheme http://ontorail.org/src/ERA/era252/concepts/train-detection/FrenchTrainDetectionSystemLimitations.
term status: stable

Gauging
type: ObjectProperty
domain: Class
  union of: Track
  union of: Vehicle Type
range: Concept
eratv index: 4.2.1
is core parameter: true
rinf index: 1.1.1.1.3.1.1
rinf index: 1.2.1.0.3.4
created: 2020-07-29
modified: 2021-09-10
comment: Gauges as defined in European standard or other local gauges, including lower or upper part. The allowed values for this property belong to the SKOS Concept Scheme http://ontorail.org/src/ERA/era252/concepts/gaugings/GaugingProfiles
term status: stable

gsmRActiveMobiles
type: ObjectProperty
type: FunctionalProperty
domain: Track
range: Concept
rinf index: 1.1.1.3.3.2
created: 2021-08-08
modified: 2021-09-12
comment: Number of active GSM-R mobiles (EDOR) or simultaneous communication session on-board for ETCS Level 2 (or level 3) needed to perform radio block centre handovers without having an operational disruption. The allowed values for this property belong to the SKOS Concept Scheme http://ontorail.org/src/ERA/era252/concepts/gsmr-number-active-mobiles/NumberActiveMobiles
label: Advised required number of active GSM-R mobiles (EDOR) or simultaneous communication session on-board for ETCS Level 2 (or level 3) needed to perform radio block centre handovers without having an operational disruption
term status: stable

Optional GSM-R functions
type: ObjectProperty
domain: Track
range: Concept
rinf index: 1.1.1.3.3.3
created: 2021-08-08
modified: 2021-09-12
comment: Use of optional GSM-R functions which might improve operation on the line. They are for information only and not for network access criteria. The allowed values for this property belong to the SKOS Concept Scheme http://ontorail.org/src/ERA/era252/concepts/gsmr-optional-functions/OptionalFunctions
term status: stable

GSM-R radio data communication
type: ObjectProperty
type: FunctionalProperty
domain: Vehicle Type
range: Concept
eratv index: 4.13.2.7
created: 2021-08-31
modified: 2021-08-31
comment: GSM-R Radio Data communication on board and its Baseline. The allowed values for this property belong to the SKOS Concept Scheme http://ontorail.org/src/ERA/era252/concepts/gsm-r-radio-data-communication/GSMRRadioDataCommunications.
term status: stable

GSM-R version
type: ObjectProperty
type: FunctionalProperty
domain: Class
  union of: Track
  union of: Vehicle Type
range: Concept
eratv index: 4.13.2.1
is core parameter: true
rinf index: 1.1.1.3.3.1
created: 2021-08-08
modified: 2021-09-12
comment: GSM-R version installed lineside/on-board. The allowed values for this property belong to the SKOS Concept Scheme http://ontorail.org/src/ERA/era252/concepts/gsmr-versions/GSMRVersions
term status: stable

GSM-R networks covered by a roaming agreement
type: ObjectProperty
domain: Track
range: Concept
rinf index: 1.1.1.3.3.5
created: 2020-08-31
modified: 2021-09-12
comment: GSM-R networks covered by a roaming agreement. The allowed values for this property belong to the SKOS Concept Scheme http://ontorail.org/src/ERA/era252/concepts/gsmr-networks/GSMRNetworks
term status: stable

has abstraction
type: ObjectProperty
inverse of: has implementation
domain: Physical Implementation Feature
range: Topological Object
created: 2020-07-29
modified: 2021-04-13
comment: Property that links a physical entity with its topological abstraction representation.
term status: stable

has implementation
type: ObjectProperty
domain: Topological Object
range: Physical Implementation Feature
created: 2020-07-29
modified: 2021-04-13
comment: Property that links a topological abstraction entity with its physical representation.
term status: stable

has signal
type: ObjectProperty
domain: Net Element
range: Signal
created: 2021-04-01
modified: 2021-04-01
comment: References a signal associated with a topology object.
term status: stable

hot axle box detector direction
type: ObjectProperty
sub property of: topObjectProperty
domain: Track
range: Concept
rinf index: 1.1.1.1.7.9
created: 2022-07-08
comment: Direction of measurement of trackside HABD. Specific for the French Italian and Swedish networks. This property was previously a datatype property with domain Track and range string. As its values are a list of three predefined values, it is now a SKOS. The allowed values for this property belong to the SKOS Concept Scheme http://ontorail.org/src/ERA/era252/concepts/hot-axle/HotAxleBoxDetectorDirections

in country
type: ObjectProperty
domain: Physical Implementation Feature
range: Concept
created: 2020-09-01
modified: 2020-11-20
comment: Indicates the country in which an entity resides. The allowed values for this property belong to the SKOS Concept Scheme http://publications.europa.eu/resource/authority/country
term status: stable

infrastructure manager
type: ObjectProperty
domain: Physical Implementation Feature
range: Infrastructure manager
created: 2022-07-07
comment: Relates any feature implemented in the European railway infrastructure with its infrastructure manager.

Other radio systems installed (Radio Legacy Systems)
type: ObjectProperty
domain: Class
  union of: Track
  union of: Vehicle Type
range: Concept
eratv index: 4.13.2.3
is core parameter: true
rinf index: 1.1.1.3.6.1
created: 2020-08-31
modified: 2021-09-12
comment: Indication of radio legacy systems installed. The allowed values for this property belong to the SKOS Concept Scheme http://ontorail.org/src/ERA/era252/concepts/legacy-radio-systems/LegacyRadioSystems
term status: stable

Category of line
type: ObjectProperty
domain: National Railway Line
range: Concept
is core parameter: true
rinf index: 1.1.1.1.2.2
rinf index: 1.2.1.0.2.2
created: 2021-08-02
modified: 2021-08-11
comment: Classification of a line according to the INF TSI. The allowed values for this property belong to the SKOS Concept Scheme http://ontorail.org/src/ERA/era252/concepts/line-category/LineCategories
term status: stable

National line identification
type: ObjectProperty
type: FunctionalProperty
domain: Class
  union of: Line Reference
  union of: Section Of Line
range: National Railway Line
is core parameter: true
rinf index: 1.1.0.0.0.2
created: 2020-09-30
modified: 2021-08-11
comment: Related national railway line.
term status: stable

Railway location of Operational point
type: ObjectProperty
domain: Operational Point
range: Line Reference
is core parameter: true
rinf index: 1.2.0.0.0.6
created: 2021-01-29
modified: 2021-08-11
comment: Indicates a relationship with a national railway line at a specific kilometer point.
term status: stable

Load Capability
type: ObjectProperty
domain: Track
range: Concept
is core parameter: true
rinf index: 1.1.1.1.2.4
created: 2020-08-24
modified: 2021-09-10
comment: A combination of the line category and speed at the weakest point of the track. The allowed values for this property belong to the SKOS Concept Scheme http://ontorail.org/src/ERA/era252/concepts/load-capabilities/LoadCapabilities
term status: stable

Use of magnetic brakes
type: ObjectProperty
type: FunctionalProperty
domain: Track
range: Concept
is core parameter: true
rinf index: 1.1.1.1.6.3
created: 2020-08-24
modified: 2022-09-12
comment: Use of magnetic brakes. The allowed values for this property belong to the SKOS Concept Scheme http://ontorail.org/src/ERA/era252/concepts/magnetic-braking/MagneticBraking. This property has been modified to be a RINF parameter (its eratvIndex is deleted). It is treated as a SKOS by RINF and as a boolean by ERATV. A new ERATV datatype property has been defined, magneticBrakingFitted with boolean values.
term status: stable

manufacturer
type: ObjectProperty
domain: Vehicle Type
range: Manufacturer
created: 2020-07-29
modified: 2020-11-19
comment: Vehicle manufacturer company.
term status: stable

manufacturing country
type: ObjectProperty
domain: Class
  union of: Vehicle
  union of: Vehicle Type
range: Concept
created: 2020-09-30
modified: 2020-11-22
comment: Indicates the country in which a vehicle or vehicle type is manufactured. The allowed values for this property belong to the SKOS Concept Scheme http://publications.europa.eu/resource/authority/country
term status: stable

Maximum amount of sand
type: ObjectProperty
domain: Train Detection System
range: Concept
rinf index: 1.1.1.3.7.17
created: 2021-08-08
modified: 2021-08-08
comment: Maximum amount of sand accepted on the track within value of sanding output for 30s, given in grams. The allowed values for this property belong to the SKOS Concept Scheme http://ontorail.org/src/ERA/era252/concepts/max-amount-sandings/MaxAmountSandings
term status: stable

Minimum axle load by vehicle category
type: ObjectProperty
domain: Train Detection System
range: Concept
rinf index: 1.1.1.3.7.11.1
created: 2021-08-08
modified: 2021-08-08
comment: Minimum permitted axle load per category of Vehicle, given in tons depending of the category of vehicle. The allowed values for this property belong to the SKOS Concept Scheme http://ontorail.org/src/ERA/era252/concepts/min-axle-loads-per-vehicle-category/MinAxleLoadsPerVehicleCategory
term status: stable

navigability
type: ObjectProperty
domain: Net Relation
range: Concept
created: 2021-04-01
modified: 2021-08-03
comment: Indicates the navigation possibilities between two related topological objects. The allowed values for this property belong to the SKOS Concept Scheme http://ontorail.org/src/ERA/era252/concepts/navigabilities/Navigabilities.
term status: stable

net element
type: ObjectProperty
range: Net Element
created: 2021-04-01
modified: 2022-09-06
comment: References an associated topological object. The reason for deprecating this property is that it is defined as "References an associated topological object." and the vocabulary has already a property "hasAbstraction" which relates the implementation layer with the topological layer.
deprecated: true
term status: stable

net element reference
type: ObjectProperty
domain: Spot Location
range: Net Element
source: https://wiki3.railml.org/wiki/RTM:spotLocation
definition: Reference to a railway topology net element.

not applicable
type: ObjectProperty
created: 2021-09-13
modified: 2021-09-13
comment: Reference to a property that is not applicable.
term status: unstable

not yet available
type: ObjectProperty
created: 2021-09-13
modified: 2021-09-13
comment: Reference to a property that is not yet available.
term status: unstable

Operational Point at end of Section of Line
type: ObjectProperty
domain: Section Of Line
range: Operational Point
is core parameter: true
rinf index: 1.1.0.0.0.4
created: 2021-09-09
modified: 2021-09-09
comment: Operational Point at the end of a Section of Line.
term status: stable

Operational Point at start of Section of Line
type: ObjectProperty
domain: Section Of Line
range: Operational Point
is core parameter: true
rinf index: 1.1.0.0.0.3
created: 2021-09-09
modified: 2021-09-09
comment: Operational Point at the start of a Section of Line.
term status: stable

Type of operational point
type: ObjectProperty
type: FunctionalProperty
domain: Operational Point
range: Concept
is core parameter: true
rinf index: 1.2.0.0.0.4
created: 2020-07-29
modified: 2021-08-03
comment: Indicates the type on an operational point. The allowed values for this property belong to the SKOS Concept Scheme http://ontorail.org/src/ERA/era252/concepts/op-types/OperationalPointTypes.
term status: stable

operational restriction
type: ObjectProperty
domain: Vehicle
range: Concept
created: 2020-11-23
modified: 2021-08-03
comment: Indicates an operational restriction of vehicle or wagon. Parking brake type (if the vehicle is fitted with it). The allowed values for this property belong to the SKOS Concept Scheme http://ontorail.org/src/ERA/era252/concepts/restrictions/Restrictions.
term status: stable

osmClass
type: ObjectProperty
domain: Track
range: Concept
definition: Additional concept class according to OpenStreetMap. The allowed values for this property belong to the SKOS Concept Scheme http://ontorail.org/src/ERA/era252/concepts/osmclass/OSMClasses.

Accepted other pantograph heads
type: ObjectProperty
domain: Track
range: Concept
rinf index: 1.1.1.2.3.2
created: 2022-06-03
modified: 2022-06-03
comment: Indication of which non-TSI compliant pantograph heads are allowed to be used. The allowed values for this property belong to the SKOS Concept Scheme http://ontorail.org/src/ERA/era252/concepts/other-pantograph-heads/OtherPantographHeads.
term status: stable

Other train protection, control and warning systems for degraded situation
type: ObjectProperty
type: FunctionalProperty
domain: Track
range: Concept
rinf index: 1.1.1.3.10.2
created: 2021-08-09
modified: 2021-09-12
comment: Other train protection, control and warning systems for degraded situation. The allowed values for this property belong to the SKOS Concept Scheme http://ontorail.org/src/ERA/era252/concepts/other-protection-control-warning/OtherProtectionControlWarnings
term status: stable

parking brake type
type: ObjectProperty
domain: Vehicle Type
range: Concept
eratv index: 4.7.3.2
created: 2021-08-26
modified: 2021-08-26
comment: Parking brake type (if the vehicle is fitted with it). The allowed values for this property belong to the SKOS Concept Scheme http://ontorail.org/src/ERA/era252/concepts/brake-parking-type/BrakeParkingType.
term status: stable

part of
type: ObjectProperty
domain: linear location
range: Net Element
created: 2022-07-11
comment: Linear locations are subsections (part of) of other net elements

passes through tunnel
type: ObjectProperty
domain: Class
  union of: Net Element
  union of: Track
range: Tunnel
created: 2020-07-29
modified: 2021-08-09
comment: References a tunnel that a track goes through.
term status: stable

platform
type: ObjectProperty
domain: Track
range: Platform
created: 2021-08-09
modified: 2021-08-09
comment: Reference to a related platform.
term status: stable

Height of platform
type: ObjectProperty
type: FunctionalProperty
domain: Platform
range: Concept
is core parameter: true
rinf index: 1.2.1.0.6.5
created: 2021-08-02
modified: 2021-08-02
comment: Distance between the upper surface of platform and running surface of the neighbouring track. It is the nominal value expressed in millimetres. The allowed values for this property belong to the SKOS Concept Scheme http://ontorail.org/src/ERA/era252/concepts/platform-heights/PlatformHeights
term status: stable

position on A
type: ObjectProperty
domain: Net Relation
range: Concept
created: 2021-04-03
modified: 2021-08-03
comment: Determines the position of the topological object A in a relation. The allowed values for this property belong to the SKOS Concept Scheme http://ontorail.org/src/ERA/era252/concepts/relation-positions/RelationPositions.
term status: stable

position on B
type: ObjectProperty
domain: Net Relation
range: Concept
created: 2021-04-03
modified: 2021-08-03
comment: Determines the position of the topological object B in a relation. The allowed values for this property belong to the SKOS Concept Scheme http://ontorail.org/src/ERA/era252/concepts/relation-positions/RelationPositions.
term status: stable

previous vehicle type
type: ObjectProperty
type: FunctionalProperty
domain: Vehicle Type
range: Vehicle Type
created: 2022-06-15
modified: 2022-06-15
comment: Denotes a the previous VehicleType.
term status: stable

Standard combined transport profile number for semi-trailers
type: ObjectProperty
domain: Track
range: Concept
is core parameter: true
rinf index: 1.1.1.1.3.5
created: 2021-08-03
modified: 2021-09-10
comment: Coding for combined transport for semi-trailers as defined in UIC Code. The allowed values for this property belong to the SKOS Concept Scheme http://ontorail.org/src/ERA/era252/concepts/profile-num-semi-trailers/ProfileNumbersSemiTrailers
term status: stable

Standard combined transport profile number for swap bodies
type: ObjectProperty
domain: Track
range: Concept
is core parameter: true
rinf index: 1.1.1.1.3.4
created: 2021-08-03
modified: 2021-09-10
comment: Coding for combined transport with swap bodies as defined in UIC Code. The allowed values for this property belong to the SKOS Concept Scheme http://ontorail.org/src/ERA/era252/concepts/profile-num-swap-bodies/ProfileNumbersSwapBodies
term status: stable

Train protection legacy system
type: ObjectProperty
domain: Class
  union of: Track
  union of: Vehicle Type
range: Concept
eratv index: 4.13.1.5
is core parameter: true
rinf index: 1.1.1.3.5.3
created: 2020-08-31
modified: 2021-09-12
comment: Indication of which class B system is installed. The allowed values for this property belong to the SKOS Concept Scheme http://ontorail.org/src/ERA/era252/concepts/train-protection-legacy-systems/TrainProtectionLegacySystems
term status: stable

quieter route exempted country
type: ObjectProperty
domain: Vehicle
range: Concept
created: 2020-11-23
modified: 2020-11-23
comment: Country where a vehicle may operate without noise restrictions. The allowed values for this property belong to the SKOS Concept Scheme http://publications.europa.eu/resource/authority/country
term status: stable

Rail inclination
type: ObjectProperty
type: FunctionalProperty
domain: Vehicle Type
range: Concept
eratv index: 4.6.5
is core parameter: true
created: 2020-08-24
modified: 2022-09-06
comment: An angle defining the inclination of the head of a rail relative to the running surface. The allowed values for this property belong to the SKOS Concept Scheme http://ontorail.org/src/ERA/era252/concepts/rail-inclinations/RailInclinations This property has been changed, its rinfIndex was deleted. RINF treats this parameter as an integer. A new datatype property for RINF has been defined called railInclinationMeasurement.
term status: stable

Fire category of rolling stock required
type: ObjectProperty
type: FunctionalProperty
domain: Tunnel
range: Concept
is core parameter: true
rinf index: 1.1.1.1.8.10
rinf index: 1.2.1.0.5.7
rinf index: 1.2.2.0.5.7
created: 2020-07-29
modified: 2021-08-10
comment: Applicable rolling stock fire category for a tunnel. The allowed values for this property belong to the SKOS Concept Scheme http://ontorail.org/src/ERA/era252/concepts/rolling-stock-fire/Categories.
term status: stable

siding
type: ObjectProperty
domain: Operational Point
range: Siding
created: 2021-08-10
modified: 2021-08-10
comment: Reference to a related siding.
term status: stable

snow ice hail conditions
type: ObjectProperty
type: FunctionalProperty
domain: Vehicle Type
range: Concept
eratv index: 4.3.3
created: 2020-08-24
modified: 2021-08-02
comment: Snow, ice and hail conditions. The allowed values for this property belong to the SKOS Concept Scheme http://ontorail.org/src/ERA/era252/concepts/ice-conditions/IceConditions
term status: stable

Nature of Section of Line
type: ObjectProperty
type: FunctionalProperty
domain: Section Of Line
range: Concept
is core parameter: true
rinf index: 1.1.0.0.0.6
created: 2021-08-08
modified: 2021-08-08
comment: Indicates the nature of a section of line. The allowed values for this property belong to the SKOS Concept Scheme http://ontorail.org/src/ERA/era252/concepts/sol-natures/SoLNatures
term status: stable

Start of tunnel
type: ObjectProperty
sub property of: hasGeometry
sub property of: location
domain: Tunnel
range: Class
  union of: Geometry
  union of: point
is core parameter: true
rinf index: 1.1.1.1.8.3
created: 2020-07-29
modified: 2021-08-11
comment: References the geolocation of the start of a tunnel.
term status: stable

state
type: ObjectProperty
type: FunctionalProperty
domain: Certificate
range: Concept
created: 2022-06-15
modified: 2022-06-15
comment: Denoting the state of the certificate and range the following instances. The allowed values for this property belong to the SKOS Concept Scheme http://ontorail.org/src/ERA/era252/concepts/states/States. This concept scheme is temporarily non-dereferenceable.
term status: stable

vehicle subcategory
type: ObjectProperty
type: FunctionalProperty
domain: Vehicle Type
range: Concept
eratv index: 1.5
created: 2020-07-29
modified: 2021-08-03
comment: Vehicle subcategory. The allowed values for this property belong to the SKOS Concept Scheme http://ontorail.org/src/ERA/era252/concepts/vehicle-types/Categories.
term status: stable

supported platform height
type: ObjectProperty
domain: Vehicle Type
range: Concept
eratv index: 4.12.3.1
created: 2020-07-29
modified: 2021-08-02
comment: Platform height for which the vehicle is de­signed. The allowed values for this property belong to the SKOS Concept Scheme http://ontorail.org/src/ERA/era252/concepts/platform-heights/PlatformHeights
term status: stable

TEN classification (of track, of platform, of siding)
type: ObjectProperty
domain: Class
  union of: Platform
  union of: Track
range: Concept
is core parameter: true
rinf index: 1.1.1.1.2.1
rinf index: 1.2.1.0.2.1
rinf index: 1.2.1.0.6.3
rinf index: 1.2.2.0.0.3
created: 2021-08-02
modified: 2021-09-10
comment: Indicates the related TEN (trans-European network). The allowed values for this property belong to the SKOS Concept Scheme http://ontorail.org/src/ERA/era252/concepts/ten-classifications/TENClassifications.
term status: stable

thermal capacity TSI reference
type: ObjectProperty
type: FunctionalProperty
domain: Vehicle Type
range: Concept
eratv index: 4.7.2.1.1
created: 2020-08-24
modified: 2021-08-02
comment: Reference case of a TSI thermal capacity. The allowed values for this property belong to the SKOS Concept Scheme http://ontorail.org/src/ERA/era252/concepts/thermal-capacity/ThermalCapacityTSIReferences
term status: stable

track
type: ObjectProperty
domain: Class
  union of: Operational Point
  union of: Section Of Line
range: Track
created: 2021-08-09
modified: 2021-09-09
comment: Reference to a related railway track.
term status: stable

Normal running direction
type: ObjectProperty
type: FunctionalProperty
domain: Track
range: Concept
is core parameter: true
rinf index: 1.1.1.0.0.2
created: 2021-09-09
modified: 2021-09-09
comment: Track normal running direction. The allowed values for this property belong to the SKOS Concept Scheme http://ontorail.org/src/ERA/era252/concepts/track-running-directions/TrackRunningDirections.
term status: stable

train detection system
type: ObjectProperty
domain: Track
range: Train Detection System
created: 2020-07-29
modified: 2021-09-12
comment: Train detection systems installed in the section of line.
term status: stable

Type of track circuits to which specific checks are needed
type: ObjectProperty
domain: Train Detection System
range: Concept
rinf index: 1.1.1.3.7.1.2
created: 2020-08-24
modified: 2021-08-08
comment: Type of track circuits or axle counter to which specific checks are needed. The allowed values for this property belong to the SKOS Concept Scheme http://ontorail.org/src/ERA/era252/concepts/train-detection-specific-checks/TrainDetectionSystemsSpecificChecks
term status: stable

Type of train detection system
type: ObjectProperty
domain: Class
  union of: Train Detection System
  union of: Vehicle Type
range: Concept
eratv index: 4.14.1
is core parameter: true
rinf index: 1.1.1.3.7.1.1
created: 2021-08-07
modified: 2021-08-07
comment: Indication of supported types of train detection systems. The allowed values for this property belong to the SKOS Concept Scheme http://ontorail.org/src/ERA/era252/concepts/train-detection/TrainDetectionSystems
term status: stable

TSI compliance of rules on the use of composite brake blocks
type: ObjectProperty
domain: Train Detection System
range: Concept
rinf index: 1.1.1.3.7.21
created: 2021-08-08
modified: 2021-08-09
comment: TSI compliance of rules on the use of composite brake blocks. The allowed values for this property belong to the SKOS Concept Scheme http://ontorail.org/src/ERA/era252/concepts/tsi-compliances/TSICompliances.
term status: stable

TSI compliance of Ferromagnetic characteristics of wheel material required
type: ObjectProperty
domain: Train Detection System
range: Concept
rinf index: 1.1.1.3.7.14
created: 2021-08-08
modified: 2021-08-08
comment: TSI compliance of Ferromagnetic characteristics of wheel material required. The allowed values for this property belong to the SKOS Concept Scheme http://ontorail.org/src/ERA/era252/concepts/tsi-compliances/TSICompliances. The concept scheme is temporarily non-deferenceable.
term status: stable

TSI compliance of maximum permitted distance between two consecutive axles
type: ObjectProperty
domain: Train Detection System
range: Concept
is core parameter: true
rinf index: 1.1.1.3.7.2.1
created: 2021-08-07
modified: 2021-08-09
comment: Indication whether required distance between two consecutive axles is compliant with the TSI. The allowed values for this property belong to the SKOS Concept Scheme http://ontorail.org/src/ERA/era252/concepts/tsi-compliances/TSICompliances.
term status: stable

TSI compliance of maximum permitted impedance between opposite wheels of a wheelset
type: ObjectProperty
domain: Train Detection System
range: Concept
rinf index: 1.1.1.3.7.15.1
created: 2021-08-08
modified: 2021-08-09
comment: TSI compliance of maximum permitted impedance between opposite wheels of a wheelset. The allowed values for this property belong to the SKOS Concept Scheme http://ontorail.org/src/ERA/era252/concepts/tsi-compliances/TSICompliances.
term status: stable

TSI compliance of rules for vehicle metal construction
type: ObjectProperty
domain: Train Detection System
range: Concept
rinf index: 1.1.1.3.7.13
created: 2021-08-08
modified: 2021-08-09
comment: TSI compliance of rules for vehicle metal construction. The allowed values for this property belong to the SKOS Concept Scheme http://ontorail.org/src/ERA/era252/concepts/tsi-compliances/TSICompliances.
term status: stable

TSI compliance of rules for metal-free space around wheels
type: ObjectProperty
domain: Train Detection System
range: Concept
rinf index: 1.1.1.3.7.12
created: 2021-08-08
modified: 2021-08-09
comment: TSI compliance of rules for metal-free space around wheels. The allowed values for this property belong to the SKOS Concept Scheme http://ontorail.org/src/ERA/era252/concepts/tsi-compliances/TSICompliances.
term status: stable

TSI compliance of rules on combination of RST characteristics influencing shunting impedance
type: ObjectProperty
domain: Train Detection System
range: Concept
rinf index: 1.1.1.3.7.23
created: 2021-08-08
modified: 2021-08-09
comment: TSI compliance of rules on combination of RST characteristics influencing shunting impedance. The allowed values for this property belong to the SKOS Concept Scheme http://ontorail.org/src/ERA/era252/concepts/tsi-compliances/TSICompliances.
term status: stable

TSI Compliance of rules on sand characteristics
type: ObjectProperty
domain: Train Detection System
range: Concept
rinf index: 1.1.1.3.7.19
created: 2021-08-08
modified: 2021-08-09
comment: TSI Compliance of rules on sand characteristics. The allowed values for this property belong to the SKOS Concept Scheme http://ontorail.org/src/ERA/era252/concepts/tsi-compliances/TSICompliances.
term status: stable

TSI compliance of sanding
type: ObjectProperty
domain: Train Detection System
range: Concept
rinf index: 1.1.1.3.7.16
created: 2021-08-08
modified: 2021-08-09
comment: TSI compliance of sanding rules to allow compatibility with track circuits. Too much sand brings the risk of not detecting trains in tracks equipped with track circuits. The allowed values for this property belong to the SKOS Concept Scheme http://ontorail.org/src/ERA/era252/concepts/tsi-compliances/TSICompliances.
term status: unstable

TSI compliance of rules on shunt assisting devices
type: ObjectProperty
domain: Train Detection System
range: Concept
rinf index: 1.1.1.3.7.22
created: 2021-08-08
modified: 2021-08-09
comment: TSI compliance of rules on shunt assisting devices. The allowed values for this property belong to the SKOS Concept Scheme http://ontorail.org/src/ERA/era252/concepts/tsi-compliances/TSICompliances.
term status: stable

Accepted TSI compliant pantograph heads
type: ObjectProperty
domain: Track
range: Concept
rinf index: 1.1.1.2.3.1
created: 2020-08-25
modified: 2021-09-11
comment: Indication of which TSI compliant pantograph heads are allowed to be used. The allowed values for this property belong to the SKOS Concept Scheme http://ontorail.org/src/ERA/era252/concepts/compliant-pantograph-heads/CompliantPantographHeads.
term status: stable

vehicle keeper
type: ObjectProperty
domain: Vehicle
range: Vehicle Keeper
created: 2020-11-23
modified: 2020-11-23
comment: Indicates the organization that owns/operated a vehicle or wagon. http://ontorail.org/src/ERA/era252/concepts/tsi-compliances/TSICompliances
term status: stable

vehicle type
type: ObjectProperty
domain: Vehicle
range: Vehicle Type
created: 2020-11-22
modified: 2020-11-22
comment: Indicates the vehicle type of a specific vehicle or wagon.
term status: stable

voice GSM-R network
type: ObjectProperty
type: FunctionalProperty
domain: Vehicle Type
range: Concept
eratv index: 4.13.2.10
created: 2020-08-31
modified: 2021-08-02
comment: Voice SIM Card GSM-R Home Network. The allowed values for this property belong to the SKOS Concept Scheme http://ontorail.org/src/ERA/era252/concepts/gsmr-networks/GSMRNetworks
term status: stable

Radio system compatibility voice
type: ObjectProperty
domain: Class
  union of: Track
  union of: Vehicle Type
range: Concept
eratv index: 4.13.2.5
rinf index: 1.1.1.3.3.9
created: 2020-08-31
modified: 2021-09-12
comment: Radio requirements used for demonstrating technical compatibility voice. The allowed values for this property belong to the SKOS Concept Scheme http://ontorail.org/src/ERA/era252/concepts/voice-radio-system-compatibilities/VoiceRadioSystemCompatibilities. This concept scheme is temporatily non-deferenceable.
term status: stable

Nominal track gauge
type: ObjectProperty
type: FunctionalProperty
domain: Class
  union of: Track
  union of: Vehicle Type
range: Concept
eratv index: 4.1.3
is core parameter: true
rinf index: 1.1.1.1.4.1
rinf index: 1.2.1.0.4.1
created: 2020-07-29
modified: 2021-09-10
comment: A single value expressed in millimetres that identifies the track and vehicle wheel set gauge. The allowed values for this property belong to the SKOS Concept Scheme http://ontorail.org/src/ERA/era252/concepts/nominal-track-gauges/NominalTrackGauges
term status: stable

wheelset gauge changeover facility
type: ObjectProperty
type: FunctionalProperty
domain: Vehicle Type
range: Concept
eratv index: 4.1.11
created: 2020-09-01
modified: 2021-08-25
comment: Wheelset gauge changeover facility. The allowed values for this property belong to the SKOS Concept Scheme http://ontorail.org/src/ERA/era252/concepts/gauge-changeover-facilities/GaugeChangeoverFacilities
term status: stable

Acceleration allowed at level crossing
type: DatatypeProperty
type: FunctionalProperty
domain: Track
range: string
rinf index: 1.1.1.1.7.3
created: 2021-08-03
modified: 2021-09-11
comment: Existence of limit for acceleration of train if stopping or recovering speed close to a level crossing expressed in a specific reference acceleration curve.
term status: stable

Documents available by the IM relating to braking performance
type: DatatypeProperty
domain: Track
range: string
rinf index: 1.1.1.3.11.3
created: 2020-08-24
modified: 2021-09-12
comment: Electronic document available in two EU languages from the IM stored by the Agency providing additional information as defined in point (2) of point 4.2.2.6.2 of the Annex to Regulation XXX - OPE TSI.
term status: stable

alternative name
type: DatatypeProperty
type: FunctionalProperty
domain: Vehicle Type
range: string
eratv index: 1.2
created: 2020-07-29
modified: 2020-07-29
comment: Alternative name of a vehicle.
term status: stable

altitude range
type: DatatypeProperty
domain: Vehicle Type
range: string
eratv index: 4.3.2
created: 2021-08-26
modified: 2021-08-26
comment: Altitude range.
term status: stable

altitude range detail
type: DatatypeProperty
domain: Vehicle Type
range: integer
eratv index: 4.3.2.1
created: 2021-08-26
modified: 2021-08-26
comment: Altitude range value for 'X' if value 'AX' is selected in altitude range.
term status: stable

Areas of use of the platform boarding aid
type: DatatypeProperty
type: FunctionalProperty
domain: Platform
range: integer
is core parameter: true
rinf index: 1.2.1.0.6.7
created: 2021-08-02
modified: 2021-08-02
comment: Information of the train access level for which the boarding aid can be used. Data is presented as the vertical difference that is overcome by the platform boarding aid in millimetres. The value “0” means that the platform is not equipped with a platform boarding aid.
term status: stable

Existence of platform assistance for starting train
type: DatatypeProperty
type: FunctionalProperty
domain: Platform
range: boolean
is core parameter: true
rinf index: 1.2.1.0.6.6
created: 2021-08-02
modified: 2021-08-02
comment: Indication of existence of equipment or staff supporting the train crew in starting the train.
term status: stable

Automatic dropping device required
type: DatatypeProperty
type: FunctionalProperty
domain: Track
range: boolean
rinf index: 1.1.1.2.5.3
created: 2020-08-25
modified: 2021-09-12
comment: Indication of whether an automatic dropping device (ADD) required on the vehicle.
term status: stable

axle spacing
type: DatatypeProperty
type: FunctionalProperty
domain: Vehicle Type
range: string
eratv index: 4.5.3.4
created: 2020-08-24
modified: 2021-08-26
comment: Position of the axles along the unit. a: Distance between axles; b: Distance from end axle to the end of the nearest coupling plane; c: distance between two inside axles.
term status: stable

boarding aids
type: DatatypeProperty
domain: Vehicle Type
range: string
eratv index: 4.12.3.2
created: 2021-08-31
modified: 2021-08-31
comment: Description of any integrated boarding aids (if provided).
term status: stable

brake weight percentage
type: DatatypeProperty
type: FunctionalProperty
domain: Vehicle Type
range: string
eratv index: 4.7.6
created: 2020-08-24
modified: 2021-08-26
comment: Brake weight percentage (lambda) or Braked mass.
term status: stable

is bridge
type: DatatypeProperty
domain: Track
range: boolean
definition: Whether or not a track is associated with a bridge.

cant defficiency
type: DatatypeProperty
domain: Vehicle Type
range: integer
eratv index: 4.6.1
created: 2021-08-26
modified: 2021-08-26
comment: Cant deficiency (maximum uncompensated lateral acceleration) for which the vehicle has been assessed. For dual gauge vehicles values for each gauge have to be indicated.
term status: stable

Cant deficiency
type: DatatypeProperty
type: FunctionalProperty
domain: Track
range: integer
is core parameter: true
rinf index: 1.1.1.1.4.2
created: 2020-08-24
modified: 2021-09-10
comment: Maximum cant deficiency expressed in millimetres defined as difference between the applied cant and a higher equilibrium cant the line has been designed for.
term status: stable

catenary max rated current
type: DatatypeProperty
domain: Vehicle Type
range: double
eratv index: 4.10.3
created: 2021-08-31
modified: 2021-08-31
comment: Maximum rated current from the catenary (to be indicated for each electrical energy supply system the vehicle is equipped for), given in A.
term status: stable

certificate
type: DatatypeProperty
domain: Vehicle Type
range: string
created: 2022-06-15
modified: 2022-06-15
comment: Denotes a certificate for this particular vehicleType.
term status: stable

Document with the procedure(s) for static and dynamic route compatibility checks
type: DatatypeProperty
domain: Track
range: string
rinf index: 1.1.1.1.2.4.4
created: 2020-08-24
modified: 2021-09-10
comment: Document with the procedure(s) for static and dynamic route compatibility checks.
term status: stable

Compliance of the tunnel with INF TSI
type: DatatypeProperty
type: FunctionalProperty
domain: Tunnel
range: boolean
is core parameter: true
rinf index: 1.1.1.1.8.8.1
created: 2021-08-03
modified: 2021-08-03
comment: Compliance of the tunnel with INF TSI at the maximum permitted speed.
term status: stable

composite brake block retrofitted
type: DatatypeProperty
domain: Vehicle
range: boolean
created: 2020-11-23
modified: 2020-11-23
comment: Indicates if a vehicle's composite brake block is retrofitted
term status: stable

conditional regenerative brake
type: DatatypeProperty
domain: Contact Line System
range: boolean
rinf index: 1.1.1.2.2.4
created: 2020-08-24
modified: 2021-09-12
comment: Regenerative braking allowed under certain conditions.
term status: stable

conditions train formation
type: DatatypeProperty
domain: Vehicle Type
range: string
eratv index: 4.1.4
created: 2021-08-25
modified: 2021-08-25
comment: Conditions of use regarding train formation.
term status: stable

Cross section area
type: DatatypeProperty
type: FunctionalProperty
domain: Tunnel
range: integer
rinf index: 1.1.1.1.8.8
created: 2021-08-03
modified: 2021-08-03
comment: Smallest cross section area in square metres of the tunnel.
term status: stable

Current or power limitation on board required
type: DatatypeProperty
domain: Contact Line System
range: boolean
rinf index: 1.1.1.2.5.1
created: 2020-08-25
modified: 2021-09-12
comment: Indication of whether an on board current or power limitation function on vehicles is required.
term status: stable

dangerous goods tank code
type: DatatypeProperty
domain: Vehicle Type
range: string
eratv index: 4.1.9
created: 2021-08-25
modified: 2021-08-25
comment: Dangerous goods for which the vehicle is suitable (tank code).
term status: stable

EI declaration of demonstration for track (ENE)
type: DatatypeProperty
domain: Track
range: string
rinf index: 1.1.1.2.1.2
created: 2021-08-08
modified: 2021-09-11
comment: Unique number for EI declarations concerning requirements of ENE (ENErgy subsytem) on the specific track.
term status: stable

EI declaration of demonstration for track/siding [INF]
type: DatatypeProperty
domain: Class
  union of: Siding
  union of: Track
range: string
rinf index: 1.1.1.1.1.2
rinf index: 1.2.1.0.1.2
rinf index: 1.2.2.0.1.2
created: 2021-08-03
modified: 2021-09-10
comment: Unique number for EI declarations concerning requirements of INF (INFrastructure) TSI.
term status: stable

EI declaration of demonstration for tunnel (SRT)
type: DatatypeProperty
domain: Tunnel
range: string
rinf index: 1.1.1.1.8.6
rinf index: 1.2.1.0.5.4
rinf index: 1.2.2.0.5.4
created: 2021-08-03
modified: 2021-08-11
comment: Unique number for EI declarations concerning requirements of SRT (Safety in Railway Tunnels) TSI for infrastructure system.
term status: stable

design mass under exceptional payload
type: DatatypeProperty
type: FunctionalProperty
domain: Vehicle Type
range: integer
eratv index: 4.5.2.3
created: 2020-08-24
modified: 2020-11-03
comment: Design mass under exceptional payload.
term status: stable

design mass under normal payload
type: DatatypeProperty
type: FunctionalProperty
domain: Vehicle Type
range: integer
eratv index: 4.5.2.2
created: 2020-08-24
modified: 2020-11-03
comment: Design mass under normal payload.
term status: stable

design mass in working order
type: DatatypeProperty
type: FunctionalProperty
domain: Vehicle Type
range: integer
eratv index: 4.5.2.1
created: 2020-08-24
modified: 2020-11-03
comment: Design mass in working order.
term status: stable

Diesel or other thermal traction allowed
type: DatatypeProperty
type: FunctionalProperty
domain: Tunnel
range: boolean
rinf index: 1.2.1.0.5.9
created: 2021-08-09
modified: 2021-08-09
comment: Indication whether it is allowed to use diesel or other thermal traction in the tunnel.
term status: stable

Distance between signboard and phase separation ending
type: DatatypeProperty
type: FunctionalProperty
domain: Track
range: integer
rinf index: 1.1.1.2.4.3
created: 2021-08-08
modified: 2021-09-12
comment: Distance between the signboard authorizing the driver to “raise pantograph” or “close the circuit breaker” after passing the phase separation and the end of the phase separation section. Specific for route compatibility check on French network.
term status: stable

driving cabs
type: DatatypeProperty
type: FunctionalProperty
domain: Vehicle Type
range: integer
eratv index: 4.1.1
created: 2021-08-24
modified: 2021-08-24
comment: Number of driving cabs. For wagons the number of driving cabs is to be set to zero (0).
term status: stable

eddy current brake prevention
type: DatatypeProperty
type: FunctionalProperty
domain: Vehicle Type
range: boolean
eratv index: 4.7.4.1.2
created: 2020-08-24
modified: 2020-11-03
comment: Possibility of preventing the use of the eddy current track brake (only if fitted with eddy current brake)
term status: stable

Document with the conditions for the use of eddy current brakes
type: DatatypeProperty
domain: Track
range: string
rinf index: 1.1.1.1.6.4
created: 2020-08-24
modified: 2021-09-10
comment: Document with the conditions for the use of eddy current brakes.
term status: stable

eddy current braking fitted
type: DatatypeProperty
type: FunctionalProperty
domain: Vehicle Type
range: boolean
eratv index: 4.7.4.1.1
is core parameter: true
created: 2022-09-06
comment: Eddy current track brake fitted. New property defined to distinghish it from eddyCurrentBraking which is a RINF SKOS property.

emergency braking
type: DatatypeProperty
type: FunctionalProperty
domain: Vehicle Type
range: string
eratv index: 4.7.5
created: 2020-08-24
modified: 2021-08-26
comment: Stopping distance and deceleration profile for each load condition per design maximum speed.
term status: stable

end intrinsic coordinate
type: DatatypeProperty
domain: Net Element
range: double
created: 2021-04-01
modified: 2021-04-01
comment: Indicates the coordinate point where a linear object ends.
term status: stable

energy meter installed
type: DatatypeProperty
domain: Vehicle Type
range: boolean
eratv index: 4.10.12
created: 2021-08-31
modified: 2021-08-31
comment: TSI conform energy meter for billing purposes installed on board.
term status: stable

energy supply max power
type: DatatypeProperty
domain: Vehicle Type
range: double
eratv index: 4.10.2
created: 2021-08-31
modified: 2021-08-31
comment: Maximum power (to be indicated for each energy supply system the vehicle is equipped for), given in kW.
term status: stable

Energy supply system TSI compliant
type: DatatypeProperty
domain: Contact Line System
range: boolean
rinf index: 1.1.1.2.2.1.2.1
created: 2020-08-24
modified: 2021-08-06
comment: Indication if the traction supply system (nominal voltage and frequency) is fully compliant with TSI.
term status: stable

ETCS data communication application
type: DatatypeProperty
type: FunctionalProperty
domain: Vehicle Type
range: string
eratv index: 4.13.2.9
created: 2021-08-31
modified: 2021-08-31
comment: Data communication application for ETCS implementation.
term status: stable

ETCS infill necessary for line access
type: DatatypeProperty
type: FunctionalProperty
domain: Track
range: boolean
is core parameter: true
rinf index: 1.1.1.3.2.3
created: 2021-08-08
modified: 2021-09-12
comment: Indication whether infill is required to access the line for safety reasons.
term status: stable

ETCS national applications
type: DatatypeProperty
domain: Vehicle Type
range: string
eratv index: 4.13.1.4
created: 2021-08-31
modified: 2021-08-31
comment: ETCS national applications implemented (NID_XUSER of Packet 44).
term status: stable

ETCS national packet 44 application implemented
type: DatatypeProperty
type: FunctionalProperty
domain: Track
range: boolean
rinf index: 1.1.1.3.2.5
created: 2021-08-08
modified: 2021-09-12
comment: Indication whether data for national packet 44 applications is transmitted between track and train.
term status: stable

ETCS on-board implementation
type: DatatypeProperty
type: FunctionalProperty
domain: Vehicle Type
range: string
eratv index: 4.13.1.7
created: 2021-08-31
modified: 2021-08-31
comment: ETCS on-board implementation.
term status: stable

ETCS optional functions
type: DatatypeProperty
domain: Track
range: string
rinf index: 1.1.1.3.2.7
created: 2021-08-08
modified: 2021-09-12
comment: Optional ETCS functions which might improve operation on the line.
term status: unstable

ferromagnetic wheel material
type: DatatypeProperty
domain: Vehicle Type
range: boolean
eratv index: 4.14.2.12
created: 2021-09-01
modified: 2021-09-01
comment: Wheel material is ferromagnetic.
term status: stable

fixed seats
type: DatatypeProperty
domain: Vehicle Type
range: string
eratv index: 4.12.1.1
created: 2021-08-31
modified: 2021-08-31
comment: Number of fixed seats.
term status: stable

Use of flange lubrication forbidden
type: DatatypeProperty
type: FunctionalProperty
domain: Track
range: boolean
is core parameter: true
rinf index: 1.1.1.1.7.1
created: 2021-08-08
modified: 2021-09-11
comment: Indication whether the use of on-board device for flange lubrication is forbidden
term status: stable

Existence of rules on on-board flange lubrication
type: DatatypeProperty
domain: Train Detection System
range: boolean
rinf index: 1.1.1.3.7.20
created: 2021-08-08
modified: 2021-08-08
comment: Indication whether rules for activation or deactivation of flange lubrication exist.
term status: stable

flange lubrication fitted
type: DatatypeProperty
domain: Vehicle Type
range: boolean
eratv index: 4.9.3.1
created: 2021-08-31
modified: 2021-08-31
comment: Indicates if the vehicle type is fitted for flange lubrication.
term status: stable

Railway location of particular points requiring specific checks
type: DatatypeProperty
domain: Track
range: string
rinf index: 1.1.1.1.3.1.2
rinf index: 1.2.1.0.3.5
created: 2020-07-29
modified: 2021-09-10
comment: Location of particular points requiring specific checks due to deviations from gauging. The location (generally the distance from the origin of the line to the centre) on a line is given in kilometres with decimals (precision of 0.001).
term status: stable

Document with the transversal section of the particular points requiring specific checks
type: DatatypeProperty
domain: Track
range: string
rinf index: 1.1.1.1.3.1.3
rinf index: 1.2.1.0.3.6
created: 2020-08-24
modified: 2021-09-10
comment: Document with the transversal section of the particular points requiring specific checks.
term status: stable

GPRS for ETCS
type: DatatypeProperty
type: FunctionalProperty
domain: Track
range: boolean
rinf index: 1.1.1.3.3.3.2
created: 2021-08-08
modified: 2021-09-12
comment: Indication if GPRS can be used for ETCS.
term status: stable

GPRS implementation area
type: DatatypeProperty
domain: Track
range: string
rinf index: 1.1.1.3.3.3.3
created: 2021-08-09
modified: 2021-09-12
comment: Indication of the area in which GPRS can be used for ETCS.
term status: stable

Gradient for stabling tracks
type: DatatypeProperty
type: FunctionalProperty
domain: Class
  union of: Gradient Curve
  union of: Siding
range: double
rinf index: 1.2.2.0.3.1
created: 2021-08-10
modified: 2021-08-10
comment: Maximum value of the gradient for stabling tracks expressed in millimetres per metre.
term status: stable

Gradient profile
type: DatatypeProperty
domain: Track
range: string
is core parameter: true
rinf index: 1.1.1.1.3.6
created: 2020-08-24
modified: 2021-09-10
comment: Sequence of gradient values and locations of change in gradient.
term status: stable

Additional information on network characteristics
type: DatatypeProperty
domain: Track
range: string
rinf index: 1.1.1.3.3.3.1
created: 2021-08-08
modified: 2021-09-12
comment: Any additional information on network characteristics or corresponding document available from the IM and stored by the Agency, e.g.; interference level, leading to the recommendation of additional on-board protection.
term status: stable

No GSM-R coverage
type: DatatypeProperty
type: FunctionalProperty
domain: Track
range: boolean
is core parameter: true
rinf index: 1.1.1.3.3.8
created: 2021-08-09
modified: 2021-09-12
comment: Indication if there is no GSMR coverage.
term status: stable

GSM-R sets in driving cab
type: DatatypeProperty
domain: Vehicle Type
range: integer
eratv index: 4.13.2.2
created: 2021-08-31
modified: 2021-08-31
comment: Number of GSM-R mobile sets in driving cab for data transmission.
term status: stable

Availability by the IM of additional information
type: DatatypeProperty
type: FunctionalProperty
domain: Track
range: boolean
is core parameter: true
rinf index: 1.1.1.3.11.2
created: 2020-08-24
modified: 2021-09-12
comment: Availability by the IM of additional information as defined in 4.2.2.6.2 (2) Regulation XXX - OPE TSI.
term status: stable

has automatic dropping device
type: DatatypeProperty
type: FunctionalProperty
domain: Vehicle Type
range: boolean
eratv index: 4.10.11
created: 2020-08-25
modified: 2020-11-03
comment: Automatic dropping device (ADD) fitted (to be indicated for each energy supply system the vehicle is equipped for).
term status: stable

Existence of ballast
type: DatatypeProperty
type: FunctionalProperty
domain: Track
range: boolean
rinf index: 1.1.1.1.4.4
created: 2021-08-03
modified: 2021-09-10
comment: Specifies whether track construction is with sleepers embedded in ballast or not..
term status: stable

has cant defficiency compensation
type: DatatypeProperty
domain: Vehicle Type
range: boolean
eratv index: 4.6.2
created: 2021-08-26
modified: 2021-08-26
comment: Vehicle equipped with a cant deficiency compensation system (tilting vehicle).
term status: stable

has current limitation
type: DatatypeProperty
type: FunctionalProperty
domain: Vehicle Type
range: boolean
eratv index: 4.10.14
created: 2020-08-24
modified: 2020-11-03
comment: Electric units equipped with power or current limitation function.
term status: stable

Existence of operating restrictions or conditions
type: DatatypeProperty
type: FunctionalProperty
domain: Track
range: boolean
rinf index: 1.1.1.3.2.6
created: 2021-08-08
modified: 2021-09-12
comment: Indication whether restrictions or conditions due to partial compliance with the CCS TSI exist.
term status: stable

Existence of electric shore supply
type: DatatypeProperty
type: FunctionalProperty
domain: Siding
range: boolean
is core parameter: true
rinf index: 1.2.2.0.4.6
created: 2021-08-10
modified: 2021-08-10
comment: Indication whether an installation for electric shore supply exists (fixed installation for servicing trains).
term status: stable

Existence of emergency plan
type: DatatypeProperty
type: FunctionalProperty
domain: Tunnel
range: boolean
rinf index: 1.1.1.1.8.9
rinf index: 1.2.1.0.5.6
rinf index: 1.2.2.0.5.6
created: 2021-08-03
modified: 2021-08-10
comment: Indication whether emergency plan exists.
term status: stable

Existence of external cleaning facilities
type: DatatypeProperty
type: FunctionalProperty
domain: Siding
range: boolean
is core parameter: true
rinf index: 1.2.2.0.4.2
created: 2021-08-10
modified: 2021-08-10
comment: Indication whether exists an installation for external cleaning facility (fixed installation for servicing trains) as defined in INF TSIs.
term status: stable

Existence of trackside hot axle box detector (HABD)
type: DatatypeProperty
type: FunctionalProperty
domain: Track
range: boolean
is core parameter: true
rinf index: 1.1.1.1.7.4
created: 2020-08-24
modified: 2021-09-11
comment: Existence of trackside hot axle box detector (HABD).
term status: stable

Existence of level crossings
type: DatatypeProperty
type: FunctionalProperty
domain: Track
range: boolean
is core parameter: true
rinf index: 1.1.1.1.7.2
created: 2021-08-03
modified: 2021-09-11
comment: Indication whether level crossings (including pedestrian track crossing) exist on the section of line.
term status: stable

has lubrication device prevention
type: DatatypeProperty
domain: Vehicle Type
range: boolean
eratv index: 4.9.3.2
created: 2021-08-31
modified: 2021-08-31
comment: Possibility of preventing the use of the lubrication device (only if fitted with flange lubrication).
term status: stable

Existence of other train protection, control and warning systems installed
type: DatatypeProperty
type: FunctionalProperty
domain: Track
range: boolean
rinf index: 1.1.1.3.5.1
created: 2021-08-09
modified: 2021-09-12
comment: Indication if other train protection, control and warning systems in normal operation are installed lineside.
term status: unstable

has parking brake
type: DatatypeProperty
type: FunctionalProperty
domain: Vehicle Type
range: boolean
eratv index: 4.7.3.4
created: 2021-08-26
modified: 2021-08-26
comment: Indicates if a vehicle type has parking brake.
term status: stable

Existence of refuelling
type: DatatypeProperty
type: FunctionalProperty
domain: Siding
range: boolean
is core parameter: true
rinf index: 1.2.2.0.4.4
created: 2021-08-10
modified: 2021-08-10
comment: Indication whether exists an installation for refuelling (fixed installation for servicing trains) as defined in INF TSIs.
term status: stable

Permission for regenerative braking
type: DatatypeProperty
type: FunctionalProperty
domain: Vehicle Type
range: boolean
eratv index: 4.7.4.3.1
created: 2020-08-24
modified: 2021-08-06
comment: Indication whether regenerative braking is permitted or not.
term status: stable

Existence of sand restocking
type: DatatypeProperty
type: FunctionalProperty
domain: Siding
range: boolean
is core parameter: true
rinf index: 1.2.2.0.4.5
created: 2021-08-10
modified: 2021-08-10
comment: Indication whether an installation for sand restocking exists (fixed installation for servicing trains).
term status: stable

has sanding prevention
type: DatatypeProperty
domain: Vehicle Type
range: boolean
eratv index: 4.14.2.12
created: 2021-09-01
modified: 2021-09-01
comment: Possibility of preventing the use of sanding.
term status: stable

Existence of severe climatic conditions
type: DatatypeProperty
type: FunctionalProperty
domain: Track
range: boolean
is core parameter: true
rinf index: 1.1.1.1.2.8
created: 2020-08-24
modified: 2021-09-10
comment: Climatic conditions on the line are severe according to European standard.
term status: stable

has shunting restrictions
type: DatatypeProperty
type: FunctionalProperty
domain: Vehicle Type
range: boolean
eratv index: 4.8.3
created: 2021-08-31
modified: 2021-08-31
comment: Indicates the presence of shunting restrictions.
term status: stable

System separation
type: DatatypeProperty
type: FunctionalProperty
domain: Track
range: boolean
rinf index: 1.1.1.2.4.2.1
created: 2021-08-08
modified: 2021-09-12
comment: Indication of existence of system separation.
term status: stable

Existence of train detection system fully compliant with the TSI
type: DatatypeProperty
domain: Track
range: boolean
is core parameter: true
rinf index: 1.1.1.3.4.1
created: 2021-08-09
modified: 2021-09-12
comment: Indication if there is any train detection system installed and fully compliant with the CCS TSI requirements.
term status: stable

Existence of toilet discharge
type: DatatypeProperty
type: FunctionalProperty
domain: Siding
range: boolean
is core parameter: true
rinf index: 1.2.2.0.4.1
created: 2021-08-10
modified: 2021-08-10
comment: Indication whether exists an installation for toilet discharge (fixed installation for servicing trains) as defined in INF TSIs.
term status: stable

has train integrity confirmation
type: DatatypeProperty
type: FunctionalProperty
domain: Vehicle Type
range: boolean
eratv index: 4.13.1.9
created: 2020-08-31
modified: 2021-09-12
comment: Indication of on-board management system about completeness of the train information.
term status: stable

Existence of water restocking
type: DatatypeProperty
type: FunctionalProperty
domain: Siding
range: boolean
is core parameter: true
rinf index: 1.2.2.0.4.3
created: 2021-08-10
modified: 2021-08-10
comment: Indication whether exists an installation for water restocking (fixed installation for servicing trains) as defined in INF TSIs.
term status: stable

has wheel slide protection system
type: DatatypeProperty
type: FunctionalProperty
domain: Vehicle Type
range: boolean
eratv index: 4.7.8
created: 2021-08-31
modified: 2021-08-31
comment: Indicates the presence of a wheel slide protection system.
term status: stable

Compliance of structures with the High Speed Load Model (HSLM) dynamic load model
type: DatatypeProperty
type: FunctionalProperty
domain: Track
range: boolean
rinf index: 1.1.1.1.2.4.2
created: 2020-08-24
modified: 2021-09-10
comment: Compliance of structures with the High Speed Load Model (HSLM).
term status: stable

Generation of trackside HABD
type: DatatypeProperty
type: FunctionalProperty
domain: Track
range: string
rinf index: 1.1.1.1.7.7
created: 2020-08-24
modified: 2021-09-11
comment: Generation of trackside HABD. Specific for the French Italian and Swedish networks.
term status: stable

Identification of trackside HABD
type: DatatypeProperty
type: FunctionalProperty
domain: Track
range: string
rinf index: 1.1.1.1.7.6
created: 2020-08-24
modified: 2021-09-11
comment: Identification of trackside HABD. Applicable if trackside HABD is not TSI compliant.
term status: stable

Railway location of trackside HABD
type: DatatypeProperty
domain: Track
range: double
rinf index: 1.1.1.1.7.8
created: 2020-08-24
modified: 2021-09-11
comment: Railway location of trackside HABD. Applicable if trackside HABD is not TSI compliant.
term status: stable

Trackside HABD TSI compliant
type: DatatypeProperty
type: FunctionalProperty
domain: Track
range: boolean
rinf index: 1.1.1.1.7.5
created: 2020-08-24
modified: 2021-09-11
comment: Trackside HABD TSI compliant. Specific for the French, Italian and Swedish networks.
term status: stable

IM's code
type: DatatypeProperty
sub property of: identifier
type: FunctionalProperty
domain: Infrastructure manager
range: string
is core parameter: true
rinf index: 1.1.0.0.0.1
rinf index: 1.1.1.1.8.1
rinf index: 1.2.1.0.0.1
rinf index: 1.2.1.0.5.1
rinf index: 1.2.1.0.6.1
rinf index: 1.2.2.0.0.1
rinf index: 1.2.2.0.5.1
created: 2021-08-02
modified: 2022-07-07
comment: Infrastructure Manager means any body or undertaking that is responsible in particular for establishing and maintaining railway infrastructure or a part thereof. The Code is a unique identifier for the Infrastructure Manager and it shall be verified on national level.
term status: stable

Belonging to a quieter route
type: DatatypeProperty
type: FunctionalProperty
domain: Track
range: boolean
is core parameter: true
rinf index: 1.1.1.1.7.11
created: 2020-11-04
modified: 2021-09-12
comment: Indication of a track being part of a route with noise restrictions
term status: stable

is switchable
type: DatatypeProperty
domain: Signal
range: boolean
created: 2021-04-01
modified: 2021-04-01
comment: Indicates if a signal can be switched to show different messages or if it is a static panel.
term status: stable

kilometer
type: DatatypeProperty
domain: Class
  union of: Line Reference
  union of: Spot Location
range: double
created: 2021-01-29
modified: 2021-01-29
comment: Distance measured in kilometers from the origin of a national railway line.
term status: stable

Length (of Section of Line, of Tunnel, of Siding, Usable lenght of Platform)
type: DatatypeProperty
type: FunctionalProperty
domain: ERA Feature
range: double
eratv index: 4.8.1
is core parameter: true
rinf index: 1.1.0.0.0.5
rinf index: 1.1.1.1.8.7
rinf index: 1.2.1.0.5.5
rinf index: 1.2.1.0.6.4
rinf index: 1.2.2.0.2.1
rinf index: 1.2.2.0.5.5
created: 2021-04-01
modified: 2021-08-11
comment: Length of a physical object, which can be a section of line, a tunnel, a platform, etc.
term status: stable

letter marking
type: DatatypeProperty
domain: Vehicle Type
range: string
eratv index: 4.1.7
created: 2021-08-25
modified: 2021-08-25
comment: letter marking
term status: stable

linear coordinate
type: DatatypeProperty
range: double
created: 2021-04-01
modified: 2021-04-01
comment: Indicates the position of an object within a linear positioning system. For example, relative to a national railway line.
term status: stable

loading platform height
type: DatatypeProperty
domain: Vehicle Type
range: integer
eratv index: 4.8.7
created: 2021-08-31
modified: 2021-08-31
comment: Height of loading platform (for flat wagons and combined transport), given in mm.
term status: stable

Existence of rules and restrictions of a strictly local nature
type: DatatypeProperty
domain: Class
  union of: Operational Point
  union of: Track
range: boolean
rinf index: 1.1.1.4.1
rinf index: 1.2.3.1
created: 2021-08-09
modified: 2021-09-12
comment: Existence of rules and restrictions of a strictly local nature.
term status: stable

Reference of the documents regarding the rules or restrictions of a strictly local nature available by the IM
type: DatatypeProperty
domain: Class
  union of: Operational Point
  union of: Track
range: string
rinf index: 1.1.1.4.2
rinf index: 1.2.3.2
created: 2021-08-09
modified: 2021-09-12
comment: Documents regarding the rules or restrictions of a strictly local nature available by the IM.
term status: stable

magnetic brake prevention
type: DatatypeProperty
type: FunctionalProperty
domain: Vehicle Type
range: boolean
eratv index: 4.7.4.2.2
created: 2020-08-24
modified: 2021-04-13
comment: Possibility of preventing the use of the magnetic track brake (only if fitted with magnetic brake)
term status: stable

Document with the conditions for the use of magnetic brakes
type: DatatypeProperty
domain: Track
range: string
rinf index: 1.1.1.1.6.5
created: 2020-08-24
modified: 2021-09-11
comment: Document with the conditions for the use of magnetic brakes.
term status: stable

magnetic braking fitted
type: DatatypeProperty
domain: Vehicle Type
range: boolean
eratv index: 4.7.4.2.1
is core parameter: true
created: 2022-09-12
comment: Magnetic track brake fitted. New property defined to distinguish it from magneticBraking which is a RINF SKOS property.

mass per wheel
type: DatatypeProperty
type: FunctionalProperty
domain: Vehicle Type
range: integer
eratv index: 4.5.6
created: 2021-08-26
modified: 2021-08-26
comment: Mass per wheel, given in kg.
term status: stable

Maximum current at standstill per pantograph
type: DatatypeProperty
type: FunctionalProperty
domain: Class
  union of: Contact Line System
  union of: Siding
  union of: Vehicle Type
range: double
eratv index: 4.10.4
rinf index: 1.1.1.2.2.3
rinf index: 1.2.2.0.6.1
created: 2020-08-25
modified: 2021-09-12
comment: Indication of the maximum allowable train current at standstill for DC systems expressed in amperes.
term status: stable

Maximum permitted distance between two consecutive axles in case of TSI non-compliance
type: DatatypeProperty
domain: Class
  union of: Train Detection System
  union of: Vehicle Type
range: integer
eratv index: 4.14.2.1
rinf index: 1.1.1.3.7.2.2
created: 2021-08-08
modified: 2021-09-01
comment: Indication of maximum permitted distance between two consecutive axles in case of TSI non-compliance, given in millimetres.
term status: stable

Maximum distance between end of train and first axle
type: DatatypeProperty
domain: Train Detection System
range: integer
rinf index: 1.1.1.3.7.5
created: 2021-08-08
modified: 2021-08-08
comment: Indication of maximum distance between end of train and first axle, given in millimetres, applicable for both sides (front and rear) of a vehicle or train.
term status: stable

Maximum permitted height of the flange
type: DatatypeProperty
domain: Class
  union of: Train Detection System
  union of: Vehicle Type
range: double
eratv index: 4.14.2.9
rinf index: 1.1.1.3.7.10
created: 2021-08-08
modified: 2021-09-01
comment: Maximum permitted flange height, given in millimiters.
term status: stable

Maximum permitted impedance between opposite wheels of a wheelset when not TSI compliant
type: DatatypeProperty
domain: Class
  union of: Train Detection System
  union of: Vehicle Type
range: double
eratv index: 4.14.2.16
rinf index: 1.1.1.3.7.15.2
created: 2021-08-08
modified: 2021-08-08
comment: The value of maximum permitted impedance given in ohm in case of TSI non-compliance.
term status: stable

maximum length vehicle nose
type: DatatypeProperty
domain: Vehicle Type
range: integer
eratv index: 4.14.2.4
created: 2021-09-01
modified: 2021-09-01
comment: Maximum length of the vehicle nose.
term status: stable

maximum permissible speed
type: DatatypeProperty
domain: Speed Section
range: double

Maximum train current
type: DatatypeProperty
domain: Contact Line System
range: integer
rinf index: 1.1.1.2.2.2
created: 2021-08-06
modified: 2021-08-06
source: https://wiki2.railml.org/wiki/IS:maxTrainCurrent_electrification
comment: Maximum current taken by the complete train (composition of one or more units) expressed in amperes.
term status: stable

Maximum altitude
type: DatatypeProperty
type: FunctionalProperty
domain: Track
range: string
is core parameter: true
rinf index: 1.1.1.1.2.7
created: 2021-08-03
modified: 2021-09-10
comment: Highest point of the section of line above sea level in reference to Normal Amsterdam’s Peil (NAP). The value of the parameter shall be given in metres, with tolerance of +/-100m.
term status: stable

maximum average deceleration
type: DatatypeProperty
type: FunctionalProperty
domain: Vehicle Type
range: double
eratv index: 4.7.1
created: 2021-08-26
modified: 2021-08-26
comment: Maximum train deceleration given in m/s².
term status: stable

maximum brake thermal energy capacity
type: DatatypeProperty
type: FunctionalProperty
domain: Vehicle Type
range: integer
eratv index: 4.7.2.1.6
created: 2021-08-26
modified: 2021-08-26
comment: Maximum brake thermal energy capacity given in kJ
term status: stable

Maximum braking distance requested
type: DatatypeProperty
type: FunctionalProperty
domain: Track
range: integer
is core parameter: true
rinf index: 1.1.1.3.11.1
created: 2020-08-24
modified: 2021-09-12
comment: The maximum value of the braking distance [in meters] of a train shall be given for the maximum line speed.
term status: stable

Maximum contact wire height
type: DatatypeProperty
type: FunctionalProperty
domain: Class
  union of: Track
  union of: Vehicle Type
range: double
eratv index: 4.10.5
rinf index: 1.1.1.2.2.5
created: 2020-08-25
modified: 2021-09-11
comment: Indication of the maximum contact wire height expressed in metres.
term status: stable

maximum design speed
type: DatatypeProperty
type: FunctionalProperty
domain: Vehicle Type
range: integer
eratv index: 4.1.2.1
created: 2020-08-24
modified: 2020-11-03
comment: Maximum design speed.
term status: stable

maximum locomotives coupled
type: DatatypeProperty
type: FunctionalProperty
domain: Vehicle Type
range: integer
eratv index: 4.1.5
created: 2021-08-25
modified: 2021-08-25
comment: Maximum number of trainsets or locomotives coupled together in multiple operation.
term status: stable

Maximum permitted speed
type: DatatypeProperty
type: FunctionalProperty
domain: Track
range: integer
is core parameter: true
rinf index: 1.1.1.1.2.5
created: 2020-08-24
modified: 2021-09-10
comment: Nominal maximum operational speed on the line as a result of INF, ENE and CCS subsystem characteristics expressed in kilometres/hour.
term status: stable

maximum service break
type: DatatypeProperty
type: FunctionalProperty
domain: Vehicle Type
range: string
eratv index: 4.7.7
created: 2021-08-26
modified: 2021-08-26
comment: At maximum service brake: Stopping distance, Maximum deceleration, for the load condition 'design mass under normal payload' at the design maximum speed.
term status: stable

maximum speed and cant deficiency
type: DatatypeProperty
type: FunctionalProperty
domain: Vehicle Type
range: string
eratv index: 4.6.4
created: 2020-08-24
modified: 2021-08-02
comment: Combination of maximum speed and maximum cant deficiency for which the vehicle was assessed. This property was before an object skos property. The values for this property do not come from a list of predefined values. Thus, the original object property was replaced by this datatype property with range xsd:string.
term status: stable

maximum speed empty
type: DatatypeProperty
domain: Vehicle Type
range: integer
eratv index: 4.1.2.2
created: 2021-08-24
modified: 2021-08-24
comment: Maximum speed when empty.
term status: stable

Temperature range (maximum)
type: DatatypeProperty
domain: Class
  union of: Track
  union of: Vehicle Type
range: integer
eratv index: 4.3.1
is core parameter: true
rinf index: 1.1.1.1.2.6
created: 2020-08-24
modified: 2021-09-10
comment: Maximum tempertaure allowed for unrestricted operation access, according to European standard.
term status: stable

Maximum train deceleration
type: DatatypeProperty
type: FunctionalProperty
domain: Track
range: double
is core parameter: true
rinf index: 1.1.1.1.6.1
created: 2020-08-24
modified: 2021-09-10
comment: Limit for longitudinal track resistance given as a maximum allowed train deceleration and expressed in metres per square second.
term status: stable

meets requirement vehicle authorization
type: DatatypeProperty
domain: Vehicle Type
range: string
eratv index: 4.1.8
created: 2021-08-25
modified: 2021-08-25
comment: Type meets the requirements necessary for validity of the vehicle authorisation granted by one Member State in other MSs.
term status: stable

Minimum permitted axle load
type: DatatypeProperty
type: FunctionalProperty
domain: Class
  union of: Train Detection System
  union of: Vehicle Type
range: double
eratv index: 4.14.2.10
rinf index: 1.1.1.3.7.11
created: 2021-08-08
modified: 2021-08-08
comment: Minimum permitted axle load, given in tons.
term status: unstable

Minimum permitted distance between two consecutive axles
type: DatatypeProperty
domain: Train Detection System
range: integer
eratv index: 4.14.2.2
rinf index: 1.1.1.3.7.3
created: 2021-08-08
modified: 2021-09-01
comment: Indication of minimum permitted distance between two consecutive axles, given in millimetres.
term status: stable

Minimum permitted distance between first and last axle
type: DatatypeProperty
domain: Class
  union of: Train Detection System
  union of: Vehicle Type
range: integer
eratv index: 4.14.2.3
rinf index: 1.1.1.3.7.4
created: 2021-08-08
modified: 2021-08-08
comment: Indication of minimum permitted distance between first and last axles, given in millimetres.
term status: stable

Minimum permitted height of the flange
type: DatatypeProperty
domain: Class
  union of: Train Detection System
  union of: Vehicle Type
range: double
eratv index: 4.14.2.8
rinf index: 1.1.1.3.7.9
created: 2021-08-08
modified: 2021-09-01
comment: Minimum permitted flange height, given in millimiters.
term status: stable

Minimum permitted thickness of the flange
type: DatatypeProperty
domain: Class
  union of: Train Detection System
  union of: Vehicle Type
range: double
eratv index: 4.14.2.7
rinf index: 1.1.1.3.7.8
created: 2021-08-08
modified: 2021-09-01
comment: Minimum permitted flange thickness, given in millimiters.
term status: stable

Minimum permitted width of the rim
type: DatatypeProperty
domain: Class
  union of: Train Detection System
  union of: Vehicle Type
range: double
eratv index: 4.14.2.5
rinf index: 1.1.1.3.7.6
created: 2021-08-08
modified: 2021-09-01
comment: Minimum permitted width of the rim, given in millimiters.
term status: stable

minimum vehicle impedance
type: DatatypeProperty
domain: Vehicle Type
range: string
eratv index: 4.14.2.17
created: 2021-09-01
modified: 2021-09-01
comment: Minimum vehicle impedance (between wheels and pantograph) (only for vehicles equipped for 1500V or 3000V DC).
term status: stable

Minimum permitted wheel diameter
type: DatatypeProperty
domain: Class
  union of: Train Detection System
  union of: Vehicle Type
range: integer
eratv index: 4.14.2.6
rinf index: 1.1.1.3.7.7
created: 2021-08-08
modified: 2021-09-01
comment: Minimum permitted wheel diameter, given in millimiters.
term status: stable

minimum concave vertical radius
type: DatatypeProperty
type: FunctionalProperty
domain: Vehicle Type
range: integer
eratv index: 4.8.6
created: 2020-08-24
modified: 2020-11-03
comment: Minimum vertical concave curve radius capability.
term status: stable

Minimum contact wire height
type: DatatypeProperty
type: FunctionalProperty
domain: Class
  union of: Track
  union of: Vehicle Type
range: double
eratv index: 4.10.5
rinf index: 1.1.1.2.2.6
created: 2020-08-25
modified: 2021-09-11
comment: Indication of the minimum contact wire height expressed in metres.
term status: stable

minimum convex vertical radius
type: DatatypeProperty
type: FunctionalProperty
domain: Vehicle Type
range: integer
eratv index: 4.8.5
created: 2020-08-24
modified: 2020-11-03
comment: Minimum vertical convex curve radius capability.
term status: stable

Minimum radius of horizontal curve
type: DatatypeProperty
type: FunctionalProperty
domain: Class
  union of: Siding
  union of: Track
  union of: Vehicle Type
range: integer
eratv index: 4.8.4
is core parameter: true
rinf index: 1.1.1.1.3.7
rinf index: 1.2.2.0.3.2
created: 2020-08-24
modified: 2021-09-10
comment: Radius of the smallest horizontal curve of the track in metres.
term status: stable

Temperature range (minimum)
type: DatatypeProperty
domain: Class
  union of: Track
  union of: Vehicle Type
range: integer
eratv index: 4.3.1
is core parameter: true
rinf index: 1.1.1.1.2.6
created: 2020-08-24
modified: 2021-09-10
comment: Minimum tempertaure allowed for unrestricted operation access, according to European standard.
term status: stable

minimum radius of vertical curve
type: DatatypeProperty
type: FunctionalProperty
domain: Siding
range: string
rinf index: 1.2.2.0.3.3
created: 2020-08-24
modified: 2021-09-12
comment: Radius of the smallest vertical curve expressed in metres.
term status: stable

Minimum wheel diameter for fixed obtuse crossings
type: DatatypeProperty
type: FunctionalProperty
domain: Class
  union of: Track
  union of: Vehicle Type
range: integer
eratv index: 4.8.2
is core parameter: true
rinf index: 1.1.1.1.5.2
created: 2020-08-24
modified: 2021-09-10
comment: Maximum unguided length of fixed obtuse crossings is based on a minimum wheel diameter in service expressed in millimetres.
term status: stable

Need for more than one train protection, control and warning system required on board
type: DatatypeProperty
type: FunctionalProperty
domain: Track
range: boolean
rinf index: 1.1.1.3.5.2
created: 2021-08-09
modified: 2021-09-12
comment: Indication whether more than one train protection, control and warning system is required to be on-board and active simultaneously.
term status: unstable

National classification for load capability
type: DatatypeProperty
domain: Track
range: string
rinf index: 1.1.1.1.2.4.1
created: 2020-08-24
modified: 2021-09-10
comment: National classification for load capability.
term status: stable

National fire category of rolling stock required
type: DatatypeProperty
type: FunctionalProperty
domain: Tunnel
range: string
rinf index: 1.1.1.1.8.11
rinf index: 1.2.1.0.5.8
rinf index: 1.2.2.0.5.8
created: 2020-07-29
modified: 2021-08-10
comment: Applicable national rolling stock fire category for a tunnel.
term status: stable

netElementPosition
type: DatatypeProperty
domain: Spot Location
range: integer

non coded restrictions
type: DatatypeProperty
type: FunctionalProperty
domain: Vehicle Type
range: string
created: 2022-06-15
modified: 2022-06-15
comment: Denotes a non coded restrictions for this particular vehicleType, as a set of sentences.
term status: stable

number elements rake freight wagons
type: DatatypeProperty
domain: Vehicle Type
range: integer
eratv index: 4.1.6
created: 2021-08-25
modified: 2021-08-25
comment: Number of elements in the rake of freight wagons (only for subcategory 'rake of freight wagons')
term status: stable

number of pantographs in contact with OCL
type: DatatypeProperty
type: FunctionalProperty
domain: Vehicle Type
range: integer
eratv index: 4.10.7
created: 2020-08-25
modified: 2020-11-19
comment: Number of pantographs in contact with the overhead contact line (OCL) (to be indicated for each energy supply system the vehicle is equipped for).
term status: stable

number of toilets
type: DatatypeProperty
domain: Vehicle Type
range: integer
eratv index: 4.12.1.2
created: 2021-08-31
modified: 2021-08-31
comment: Number of toilets.
term status: stable

ocl type
type: DatatypeProperty
domain: Vehicle Type
range: string
eratv index: 4.10.9
created: 2020-08-25
modified: 2020-10-03
comment: OCL type.
term status: stable

Name of Operational point
type: DatatypeProperty
type: FunctionalProperty
domain: Operational Point
range: string
is core parameter: true
rinf index: 1.2.0.0.0.1
created: 2021-09-13
modified: 2021-09-13
comment: Name of an Operational Point.
term status: stable

Type of track gauge changeover facility
type: DatatypeProperty
type: FunctionalProperty
domain: Operational Point
range: string
rinf index: 1.2.0.0.0.4.1
created: 2021-08-11
modified: 2021-08-11
comment: Type of track gauge changeover facility.
term status: stable

parking brake
type: DatatypeProperty
domain: Vehicle Type
range: boolean
eratv index: 4.7.3
created: 2022-04-11
modified: 2022-04-11
comment: Indicates whether all vehicles of this type must be equipped with a parking brake.
term status: stable

parking brake mandatory
type: DatatypeProperty
domain: Vehicle Type
range: boolean
eratv index: 4.7.3.1
created: 2021-08-26
modified: 2021-08-26
comment: All vehicles of this type must be equipped with a parking brake (parking brake mandatory for vehicles of this type).
term status: stable

parking brake maximum gradient
type: DatatypeProperty
type: FunctionalProperty
domain: Vehicle Type
range: double
eratv index: 4.7.3.3
created: 2020-08-24
modified: 2020-11-03
comment: Maximum gradient on which the unit is kept immobilised by the parking brake alone (if the vehicle is fitted with it).
term status: stable

pass-by noise level
type: DatatypeProperty
domain: Vehicle Type
range: double
eratv index: 4.11.1
created: 2021-08-31
modified: 2021-08-31
comment: Pass-by noise level given in dB(A).
term status: stable

permissible payload
type: DatatypeProperty
type: FunctionalProperty
domain: Vehicle Type
range: string
eratv index: 4.5.1
created: 2020-08-24
modified: 2020-11-03
comment: Permissible payload for different line categories.
term status: stable

Contact force permitted
type: DatatypeProperty
type: FunctionalProperty
domain: Track
range: string
rinf index: 1.1.1.2.5.2
created: 2020-08-25
modified: 2021-09-12
comment: Indication of contact force allowed expressed in newtons.
term status: stable

Information on phase separation
type: DatatypeProperty
type: FunctionalProperty
domain: Track
range: string
rinf index: 1.1.1.2.4.1.2
created: 2021-08-08
modified: 2021-09-12
comment: Required information on phase separation. Data is structured as: length [NNN] + switch off breaker [Y/N] + lower pantograph [Y/N]).
term status: stable

Phase separation
type: DatatypeProperty
type: FunctionalProperty
domain: Track
range: boolean
rinf index: 1.1.1.2.4.1.1
created: 2021-08-08
modified: 2021-09-12
comment: Indication of existence of phase separation and required information.
term status: stable

platform id
type: DatatypeProperty
type: FunctionalProperty
domain: Platform
range: string
is core parameter: true
rinf index: 1.2.1.0.6.2
created: 2021-09-13
modified: 2021-09-13
comment: Unique platform identification or number within an Operational Point.
term status: stable

portable boarding aids
type: DatatypeProperty
domain: Vehicle Type
range: string
eratv index: 4.12.3.3
created: 2021-08-31
modified: 2021-08-31
comment: Description of any portable boarding aids if considered in the design of the vehicle for meeting the PRM TSI requirements.
term status: stable

position begin
type: DatatypeProperty
domain: Net Element
range: double

position end
type: DatatypeProperty
domain: Net Element
range: double

prevent regenerative brake use
type: DatatypeProperty
type: FunctionalProperty
domain: Vehicle Type
range: boolean
eratv index: 4.7.4.3.2
created: 2020-08-24
modified: 2020-11-03
comment: Possibility of preventing the use of the regenerative brake (only if fitted with regenerative brake).
term status: stable

priority seats
type: DatatypeProperty
domain: Vehicle Type
range: string
eratv index: 4.12.2.1
created: 2021-08-31
modified: 2021-08-31
comment: Number of priority seats.
term status: stable

prm accessible toilets
type: DatatypeProperty
domain: Vehicle Type
range: integer
eratv index: 4.12.2.3
created: 2021-08-31
modified: 2021-08-31
comment: Number of PRM accessible toilets.
term status: stable

Existence of roaming to public networks
type: DatatypeProperty
type: FunctionalProperty
domain: Track
range: boolean
rinf index: 1.1.1.3.3.6
created: 2021-08-09
modified: 2021-09-12
comment: Existence of roaming to public networks.
term status: stable

Details on roaming to public networks
type: DatatypeProperty
type: FunctionalProperty
domain: Track
range: string
rinf index: 1.1.1.3.3.7
created: 2021-08-09
modified: 2021-09-12
comment: Details on roaming to public networks.
term status: stable

quasi static guiding force
type: DatatypeProperty
domain: Vehicle Type
range: double
eratv index: 4.5.4
created: 2021-08-26
modified: 2021-08-26
comment: Quasi-static guiding force (if exceeds the limit defined in TSI or not defined in the TSI), given in kN.
term status: stable

radio switch over special conditions
type: DatatypeProperty
domain: Vehicle Type
range: string
eratv index: 4.13.2.4
created: 2021-08-31
modified: 2021-08-31
comment: Special conditions implemented on-board to switch over between different radio systems. Given as combination of systems installed on board ('System XX'_'System YY').
term status: stable

rail inclination measurement
type: DatatypeProperty
type: FunctionalProperty
domain: Track
range: integer
is core parameter: true
rinf index: 1.1.1.1.4.3
created: 2022-09-06
comment: An angle defining the inclination of the head of a rail relative to the running surface. This is a RINF parameter treated as an integer. It has been defined in order to distinguish it from the ERATV parameter, railInclination, which is a SKOS.
term status: stable

Requirements for number of raised pantographs and spacing between them, at the given speed
type: DatatypeProperty
domain: Track
range: string
rinf index: 1.1.1.2.3.3
created: 2020-08-25
modified: 2021-09-12
comment: Indication of maximum number of raised pantographs per train allowed and minimum spacing centre line to centre line of adjacent pantograph heads, expressed in metres, at the given speed.
term status: stable

Steady red lights required
type: DatatypeProperty
type: FunctionalProperty
domain: Track
range: boolean
rinf index: 1.1.1.1.7.10
created: 2021-08-08
modified: 2021-09-12
comment: Indication of a sections where two steady red lights are required in accordance with Regulation (EU) 2019/773
term status: stable

reference pass-by noise level
type: DatatypeProperty
domain: Vehicle Type
range: boolean
eratv index: 4.11.2
created: 2021-08-31
modified: 2021-08-31
comment: Pass-by noise level was measured under reference conditions.
term status: stable

relative position
type: DatatypeProperty
range: double
created: 2021-04-01
modified: 2021-04-01
comment: Indicates the position of an object relative to the linear coordinates of the associated topological object.
term status: stable

Sanding override by driver required
type: DatatypeProperty
domain: Train Detection System
range: boolean
rinf index: 1.1.1.3.7.18
created: 2021-08-08
modified: 2021-08-08
comment: Indication whether possibility to activate/deactivate sanding devices by driver, according to instructions from the Infrastructure Manager, is required or not.
term status: stable

shortest distance between pantographs in contact with OCL
type: DatatypeProperty
type: FunctionalProperty
domain: Vehicle Type
range: string
eratv index: 4.10.8
created: 2020-08-25
modified: 2021-09-15
comment: Shortest distance between two pantographs in contact with the OCL (to be indicated for each energy supply system the vehicle is equipped for; to be indicated for single and, if applicable, multiple operation) (only if number of raised pantographs is more than 1).
term status: stable

Identification of siding
type: DatatypeProperty
sub property of: identifier
type: FunctionalProperty
domain: Siding
range: string
is core parameter: true
rinf index: 1.2.2.0.0.2
created: 2021-09-13
modified: 2021-09-13
comment: Unique siding identification or number within an Operational Point.
term status: stable

sleeping places
type: DatatypeProperty
domain: Vehicle Type
range: string
eratv index: 4.12.1.3
created: 2021-08-31
modified: 2021-09-15
comment: Number of sleeping places.
term status: stable

Specific information
type: DatatypeProperty
type: FunctionalProperty
domain: Track
range: string
rinf index: 1.1.1.1.3.5.1
created: 2021-08-03
modified: 2021-09-10
comment: This parameters allows the IM to provide plain text with specific information about the track.
term status: stable

start intrinsic coordinate
type: DatatypeProperty
domain: Net Element
range: double
created: 2021-04-01
modified: 2021-04-01
comment: Indicates the coordinate point where a linear object begins.
term status: stable

starting noise level
type: DatatypeProperty
domain: Vehicle Type
range: double
eratv index: 4.11.4
created: 2021-08-31
modified: 2021-08-31
comment: starting noise level given in dB(A).
term status: stable

static axle load under exceptional payload
type: DatatypeProperty
type: FunctionalProperty
domain: Vehicle Type
range: double
eratv index: 4.5.3.3
created: 2020-08-24
modified: 2020-11-03
comment: Static axle load under exceptional payload.
term status: stable

static axle load under normal payload
type: DatatypeProperty
type: FunctionalProperty
domain: Vehicle Type
range: double
eratv index: 4.5.3.2
created: 2020-08-24
modified: 2020-11-03
comment: Static axle load under normal payload.
term status: stable

static axle load in working order
type: DatatypeProperty
type: FunctionalProperty
domain: Vehicle Type
range: double
eratv index: 4.5.3.1
created: 2020-08-24
modified: 2020-11-03
comment: Static axle load in working order.
term status: stable

stationary noise level
type: DatatypeProperty
domain: Vehicle Type
range: double
eratv index: 4.11.3
created: 2021-08-31
modified: 2021-08-31
comment: stationary noise level given in dB(A).
term status: stable

structural category
type: DatatypeProperty
domain: Vehicle Type
range: string
eratv index: 4.1.10
created: 2021-08-25
modified: 2021-08-25
comment: Structural category.
term status: stable

Railway location of structures requiring specific checks
type: DatatypeProperty
domain: Track
range: double
rinf index: 1.1.1.1.2.4.3
created: 2020-08-24
modified: 2021-09-10
comment: Railway location of structures requiring specific checks.
term status: stable

Existence of switch over between different protection, control and warning systems while running
type: DatatypeProperty
type: FunctionalProperty
domain: Track
range: boolean
rinf index: 1.1.1.3.8.1
created: 2021-08-09
modified: 2021-09-12
comment: Existence of switch over between different protection, control and warning systems while running.
term status: stable

Existence of switch over between different radio systems
type: DatatypeProperty
type: FunctionalProperty
domain: Track
range: boolean
rinf index: 1.1.1.3.8.2
created: 2021-08-09
modified: 2021-09-12
comment: Indication whether a switch over between different radio systems and no communication system whilst running exist.
term status: stable

Information on system separation
type: DatatypeProperty
type: FunctionalProperty
domain: Track
range: string
rinf index: 1.1.1.2.4.2.2
created: 2021-08-08
modified: 2021-09-12
comment: Required information on system separation. Data is structured as: length [NNN] + switch off breaker [Y/N] + lower pantograph [Y/N] +[CharacterString].
term status: stable

OP TAF/TAP primary code
type: DatatypeProperty
sub property of: identifier
type: FunctionalProperty
domain: Operational Point
range: string
rinf index: 1.2.0.0.0.3
created: 2020-07-29
modified: 2021-08-11
comment: Primary code developed for TAF/TAP.
term status: stable

TEN GIS identity
type: DatatypeProperty
type: FunctionalProperty
domain: Track
range: string
rinf index: 1.1.1.1.2.1.2
created: 2021-08-03
modified: 2021-09-10
comment: Indication of the GIS identity (GIS ID) of the section of TEN-T database to which the track belongs.
term status: stable

thermal capacity distance
type: DatatypeProperty
type: FunctionalProperty
domain: Vehicle Type
range: double
eratv index: 4.7.2.1.4
created: 2020-08-24
modified: 2020-11-03
comment: Thermal capacity distance. If no reference case is indicated.
term status: stable

thermal capacity gradient
type: DatatypeProperty
type: FunctionalProperty
domain: Vehicle Type
range: double
eratv index: 4.7.2.1.3
created: 2020-08-24
modified: 2020-11-03
comment: Thermal capacity gradient. If no reference case is indicated.
term status: stable

thermal capacity speed
type: DatatypeProperty
type: FunctionalProperty
domain: Vehicle Type
range: double
eratv index: 4.7.2.1.2
created: 2020-08-24
modified: 2020-11-03
comment: Thermal capacity speed. If no reference case is indicated.
term status: stable

thermal capacity time
type: DatatypeProperty
type: FunctionalProperty
domain: Vehicle Type
range: integer
eratv index: 4.7.2.1.5
created: 2020-08-24
modified: 2020-11-03
comment: Thermal capacity time. If no reference case is indicated.
term status: stable

Indication whether tilting functions are supported by ETCS
type: DatatypeProperty
domain: Track
range: boolean
rinf index: 1.1.1.3.12.1
created: 2021-08-09
modified: 2021-09-12
comment: Indication whether tilting functions are supported by ETCS.
term status: stable

total vehicle mass
type: DatatypeProperty
type: FunctionalProperty
domain: Vehicle Type
range: integer
eratv index: 4.5.5
created: 2021-08-26
modified: 2021-08-26
comment: Total vehicle mass (for each vehicle of the unit), given in kg.
term status: stable

Identification of track
type: DatatypeProperty
sub property of: identifier
type: FunctionalProperty
domain: Track
range: string
is core parameter: true
rinf index: 1.1.1.0.0.1
rinf index: 1.2.1.0.0.2
created: 2021-09-09
modified: 2021-09-09
comment: Unique track identification or unique track number within a Section of Line.
term status: stable

train control switch over special conditions
type: DatatypeProperty
domain: Vehicle Type
range: string
eratv index: 4.13.1.6
created: 2021-08-31
modified: 2021-08-31
comment: Special conditions implemented on-board to switch over between different train protection control and warning systems. Given as combination of systems installed on board ('System XX'_'System YY').
term status: stable

Document with the procedure(s) related to the type of track circuits declared in 1.1.1.3.7.1.2
type: DatatypeProperty
domain: Track
range: string
rinf index: 1.1.1.3.7.1.3
created: 2021-08-03
modified: 2021-09-12
comment: Document with the procedure(s) related to the type of track circuits declared in 1.1.1.3.7.1.2.
term status: stable

Train integrity confirmation from on-board necessary for line access
type: DatatypeProperty
type: FunctionalProperty
domain: Track
range: boolean
is core parameter: true
rinf index: 1.1.1.3.2.8
created: 2020-08-31
modified: 2021-09-12
comment: Indication whether Train Integrity monitoring system (TIMS) is required to access the line for safety reasons.
term status: stable

transportable on ferry
type: DatatypeProperty
domain: Vehicle Type
range: boolean
eratv index: 4.8.8
created: 2021-08-31
modified: 2021-08-31
comment: Indicates the suitability for transport on ferries.
term status: stable

tsi compliant
type: DatatypeProperty
range: boolean
created: 2020-11-03
modified: 2020-11-03
comment: Indicates if a certain property is TSI compliant.
term status: stable

TSI compliance of in service values for switches and crossings
type: DatatypeProperty
type: FunctionalProperty
domain: Track
range: boolean
is core parameter: true
rinf index: 1.1.1.1.5.1
created: 2021-08-03
modified: 2021-09-10
comment: Switches and crossings are maintained to in service limit dimension as specified in TSI.
term status: stable

is tunnel
type: DatatypeProperty
domain: Track
range: boolean
definition: Whether or not a track is associated with a tunnel.

Reference to a document available from the IM with precise description of the tunnel
type: DatatypeProperty
domain: Tunnel
range: string
rinf index: 1.1.1.1.8.8.2
created: 2021-08-03
modified: 2021-08-03
comment: Reference to a document available from the IM with precise description of the tunnel.
term status: stable

Tunnel identification
type: DatatypeProperty
sub property of: identifier
type: FunctionalProperty
domain: Tunnel
range: string
is core parameter: true
rinf index: 1.1.1.1.8.2
rinf index: 1.2.1.0.5.2
rinf index: 1.2.2.0.5.2
created: 2021-08-03
modified: 2021-09-13
comment: Unique tunnel identification or unique number within Member State.
term status: stable

type version number
type: DatatypeProperty
type: FunctionalProperty
domain: Vehicle Type
range: string
created: 2020-11-22
modified: 2020-11-22
comment: Serial number that identifies a vehicle type.
term status: stable

Umax2 for lines referred to in sections 7.4.2.2.1 and 7.4.2.11.1 of Regulation (EU)1301/2014.
type: DatatypeProperty
domain: Contact Line System
range: integer
rinf index: 1.1.1.2.2.1.3
created: 2020-08-24
modified: 2021-08-06
comment: Umax2 for lines referred to in sections 7.4.2.2.1 and 7.4.2.11.1 of Regulation (EU)1301/2014. Specific for the French network.
term status: stable

Unique OP ID
type: DatatypeProperty
sub property of: identifier
type: FunctionalProperty
domain: Operational Point
range: string
is core parameter: true
rinf index: 1.2.0.0.0.2
created: 2020-07-29
modified: 2021-08-11
comment: Code composed of country code and alphanumeric operational point code, as defined in RINF.
term status: stable

Use of group 555
type: DatatypeProperty
type: FunctionalProperty
domain: Class
  union of: Track
  union of: Vehicle Type
range: boolean
eratv index: 4.13.2.12
rinf index: 1.1.1.3.3.4
created: 2020-08-31
modified: 2021-09-12
comment: Indication if group 555 is needed/used.
term status: stable

vehicle contact force
type: DatatypeProperty
type: FunctionalProperty
domain: Vehicle Type
range: integer
eratv index: 4.10.15
created: 2020-08-25
modified: 2020-11-03
comment: Mean contact force.
term status: stable

vehicle kinematic gauge other
type: DatatypeProperty
domain: Vehicle Type
range: string
eratv index: 4.2.2
created: 2022-05-30
comment: Vehicle kinematic gauge that corresponds to other gauges assessed using the kinematic method
term status: stable

vehicle max sanding output
type: DatatypeProperty
domain: Vehicle Type
range: string
eratv index: 4.14.2.13
created: 2021-09-01
modified: 2021-09-01
comment: Vehicle Maximum sanding output, given in grams per second.
term status: stable

vehicle number
type: DatatypeProperty
domain: Vehicle
range: string
created: 2020-11-24
modified: 2020-11-24
comment: Identification number of a vehicle or wagon.
term status: stable

vehicle pantograph head
type: DatatypeProperty
domain: Vehicle Type
range: string
eratv index: 4.10.6
created: 2020-08-25
modified: 2020-11-03
comment: Pantograph head geometry (to be indicated for each energy supply system the vehicle is equipped for).
term status: stable

vehicle series
type: DatatypeProperty
domain: Vehicle
range: string
created: 2020-11-22
modified: 2020-11-22
comment: Manufacturing series of a vehicle.
term status: unstable

vehicles composing fixed formation
type: DatatypeProperty
type: FunctionalProperty
domain: Vehicle Type
range: integer
eratv index: 4.1.12
created: 2021-08-25
modified: 2021-08-25
comment: Number of vehicles composing the fixed formation (for fixed formation only). Note: the value is mandatory for all vehicle categories. If the vehicle is composed of only one car, the indicated value shall be '1'.
term status: stable

EC declaration of verification for track (CCS)
type: DatatypeProperty
domain: Track
range: string
rinf index: 1.1.1.3.1.1
created: 2021-08-08
modified: 2022-07-28
comment: Unique number for EC declarations concerning requirements of CCS (Command - Control and Signalling subsystem) on the specific track.
term status: stable

EC declaration of verification for track (ENE)
type: DatatypeProperty
domain: Track
range: string
rinf index: 1.1.1.2.1.1
created: 2021-08-08
modified: 2021-09-11
comment: Unique number for EC declarations concerning requirements of ENE (ENErgy subsystem) on the specific track.
term status: stable

EC declaration of verification for track/siding [INF]
type: DatatypeProperty
domain: Class
  union of: Siding
  union of: Track
range: string
rinf index: 1.1.1.1.1.1
rinf index: 1.2.1.0.1.1
rinf index: 1.2.2.0.1.1
created: 2021-08-03
modified: 2021-09-09
comment: Unique number for EC declarations concerning requirements of INF (INFrastructure) TSI.
term status: stable

EC declaration of verification for tunnel (SRT)
type: DatatypeProperty
domain: Tunnel
range: string
rinf index: 1.1.1.1.8.5
rinf index: 1.2.1.0.5.3
rinf index: 1.2.2.0.5.3
created: 2021-08-03
modified: 2021-09-02
comment: Unique number for EC declarations concerning requirements of SRT (Safety in Railway Tunnels) TSI for infrastructure system.
term status: stable

voice operational communication implementation
type: DatatypeProperty
type: FunctionalProperty
domain: Vehicle Type
range: string
eratv index: 4.13.2.6
created: 2021-08-31
modified: 2021-08-31
comment: Voice and operational communication implementation.
term status: stable

voltage
type: DatatypeProperty
domain: Net Element
range: double
source: https://otl.prorail.nl/imx/vigerend/M_VOLTAGE

wheel set gauge transformation method
type: DatatypeProperty
domain: Vehicle Type
range: string
eratv index: 4.1.3.b
created: 2021-08-25
modified: 2021-08-25
comment: Wheel gauge transformation method. Defined if more than one wheel gauges have been selected.
term status: stable

wheelchair sleeping spaces
type: DatatypeProperty
domain: Vehicle Type
range: string
eratv index: 4.12.2.4
created: 2021-08-31
modified: 2021-08-31
comment: Number of wheelchair accessible sleeping places.
term status: stable

wheelchair spaces
type: DatatypeProperty
domain: Vehicle Type
range: string
eratv index: 4.12.2.2
created: 2021-08-31
modified: 2021-08-31
comment: Number of wheelchair spaces.
term status: stable

border
type: Class
subclass of: Operational Point
source: https://wiki3.railml.org/wiki/IS:border
definition: A border point is used to separate the railway network due to different reasons. Typical examples are country borders, the change of owning infrastructure manager or the border of a station.

Certificate
type: Class
created: 2022-06-15
modified: 2022-06-15
term status: stable

Contact Line System
type: Class
created: 2021-08-04
modified: 2021-08-04
comment: System that is used to transmit electrical energy to road or rail vehicles.
term status: stable

ETCS Level
type: Class
created: 2021-08-07
modified: 2021-08-07
comment: ERTMS / ETCS application level related to the track side equipment.
term status: stable

ERA Feature
type: Class
subclass of: Feature
created: 2022-07-07
comment: Class that encompasses the features that have been physically implemented (class PhysicalImplementationFeature) and the topological objects (class Topological Object). It is a subclass of the geographical Feature class that has a spatial representation.

FreightTerminal
type: Class
subclass of: principal location
label: Freight Terminal

Gradient Curve
type: Class
subclass of: Bag

Infrastructure manager
type: Class
subclass of: Organization
source: https://wiki3.railml.org/wiki/CO:infrastructureManager
definition: The infrastructure manager owns and operates the railway network and related infrastructure.
scope note: See point (2) of Article 3 of Directive 2012/34/EU of the European Parliament and of the Council establishing a single European railway area.

Junction
type: Class
subclass of: principal location

Line Reference
type: Class
created: 2021-01-29
modified: 2021-01-29
comment: A reference to a specific national railway line.
term status: stable

linear location
type: Class
scope note: Some values are defined at parts of net elements. These parts are indicated by the

Loop
type: Class
subclass of: Track
source: Official Journal of the European Union L 139 I/85
definition: Track, connected to the main track, used for passing, crossing and stabling.

Manufacturer
type: Class
subclass of: Organization
created: 2020-11-19
modified: 2020-11-19
comment: A company or organization that manufactures vehicles.
term status: stable

National Railway Line
type: Class
created: 2021-01-25
modified: 2021-08-03
comment: Railway line within a member state.
term status: stable

Net Element
type: Class
subclass of: Topological Object
created: 2021-04-01
modified: 2021-04-01
comment: Base class for defining nodes in the connectivity graph representing the topological network.
term status: stable

Net Relation
type: Class
subclass of: Topological Object
created: 2021-04-01
modified: 2021-04-01
comment: Base class for defining edges in the connectivity graph representing the topological network.
term status: stable

Operational Point
type: Class
subclass of: Physical Implementation Feature
created: 2020-07-29
modified: 2022-07-07
comment: An operational point (OP) means any location for train service operations, where train services may begin and end or change route, and where passenger or freight services may be provided; operational point also means any location at boundaries between Member States or infrastructure managers.
term status: stable

over crossing
type: Class
subclass of: Operational Point
source: https://wiki3.railml.org/wiki/IS:overCrossing
definition: An over crossing describes a crossing, where something crosses over the railway line. From constructional point of view an over crossing can be a bridge or a tunnel. @nl

Physical Implementation Feature
type: Class
subclass of: ERA Feature
created: 2022-07-07
comment: This class encompasses all those classes that represent features that are physically implemented in the European railway infrastructure. It is a subclass of the geographical class Feature that has a spatial representation. It covers sidings, tracks, platforms, tunnels, operational points, and sections of line. A feature that has been physically implemented can be abstracted (hasAbstraction) as a topological object. It also is related to the infrastructure manager through the property infrastructureMgr.

Platform
type: Class
subclass of: Physical Implementation Feature
created: 2021-08-02
modified: 2022-07-07
comment: Platform for the purpose of RINF is understood as a platform edge. A platform concerns only the part of the structure neighbouring to the track (interfaced with trains).
term status: stable

principal location
type: Class
equivalent class: Class
  intersection of: Operational Point
  intersection of: Restriction
    on property: Type of operational point
    some values from: Concept

Section Of Line
type: Class
subclass of: Physical Implementation Feature
subclass of: Restriction
  on property: National line identification
  qualified cardinality: 1
  on class: National Railway Line
subclass of: Restriction
  on property: Operational Point at end of Section of Line
  qualified cardinality: 1
  on class: Operational Point
subclass of: Restriction
  on property: Operational Point at start of Section of Line
  qualified cardinality: 1
  on class: Operational Point
created: 2021-04-02
modified: 2022-07-07
comment: A section of line means the part of line between adjacent operational points and may consist of several tracks.
term status: stable

Siding
type: Class
subclass of: Physical Implementation Feature
created: 2021-08-10
modified: 2022-07-07
source: Official Journal of the European Union L 139 I/85
comment: Sidings are all those tracks where running trains in service movements ends and which are not used for operational routing of a train.
term status: stable
definition: Siding Any track(s) within an operational point which is not used for operational routing of a train.

Signal
type: Class
subclass of: Operational Point
created: 2021-04-01
modified: 2021-04-01
comment: A railway signal is an installation next to the railway track for signalling the maximum allowed speed in the next block section to the train driver.
term status: stable

Speed Section
type: Class
subclass of: Bag

Spot Location
type: Class
created: 2022-05-04
source: https://wiki3.railml.org/wiki/RTM:spotLocation
term status: unstable

Station
type: Class
subclass of: principal location

Stopping Place
type: Class
subclass of: Spot Location
created: 2022-05-04
source: https://wiki3.railml.org/wiki/IS:stoppingPlace
term status: unstable

switch
type: Class
subclass of: Operational Point
source: https://otl.prorail.nl/imx/vigerend/ERTMSSwitch
source: https://wiki2.railml.org/wiki/IS:switch

Topological Object
type: Class
subclass of: ERA Feature
created: 2022-05-04
term status: unstable

Track
type: Class
subclass of: Physical Implementation Feature
created: 2020-07-29
modified: 2022-07-07
comment: A running track that is used for train service movements.
term status: stable

Train Detection System
type: Class
created: 2021-08-07
modified: 2021-08-07
comment: System used to detect the position of vehicles in the railway track.
term status: stable

Tunnel
type: Class
subclass of: Physical Implementation Feature
created: 2020-07-29
modified: 2022-07-07
comment: A railway tunnel is an excavation or a construction around the track provided to allow the railway to pass for example higher land, buildings or water.
term status: stable

Vehicle
type: Class
created: 2020-11-22
modified: 2020-11-22
comment: A specific vehicle or wagon able to operate over railway lines.
term status: stable

Vehicle Keeper
type: Class
subclass of: Organization
created: 2020-11-23
modified: 2020-11-23
comment: A company or organization that owns or operates a certain vehicle.
term status: stable

Vehicle Type
type: Class
subclass of: Restriction
  on property: manufacturer
  qualified cardinality: 1
  on class: Manufacturer
created: 2020-07-29
modified: 2020-07-29
comment: A vehicle type that has been authorized to operate on the EU railway infrastructure.
term status: stable

point
type: Class
subclass of: SpatialThing
comment: Uniquely identified by lat/long/alt. i.e. spaciallyIntersects(P1, P2) :- lat(P1, LAT), long(P1, LONG), alt(P1, ALT), lat(P2, LAT), long(P2, LONG), alt(P2, ALT). sameThing(P1, P2) :- type(P1, Point), type(P2, Point), spaciallyIntersects(P1, P2).
comment: A point, typically described using a coordinate system relative to Earth, such as WGS84.

SpatialThing
type: Class
comment: Anything with spatial extent, i.e. size, shape, or position. e.g. people, places, bowling balls, as well as abstract areas like cubes.

WGS84 Geo Positioning: an RDF vocabulary
date: $Date: 2009/04/20 15:00:30 $
description: A vocabulary for representing latitude, longitude and altitude information in the WGS84 geodetic reference datum. Version $Id: wgs84_pos.rdf,v 1.22 2009/04/20 15:00:30 timbl Exp $. See http://www.w3.org/2003/01/geo/ for more details.
comment: Recent changes to this namespace: $Log: wgs84_pos.rdf,v $ Revision 1.22 2009/04/20 15:00:30 timbl Remove the time bits which have been deal with elsewhere eg in iCal. Revision 1.21 2009/04/20 12:52:47 timbl try again Revision 1.20 2009/04/20 12:42:11 timbl Add Event (edited ages ago and never checked in), and location (following discussion http://chatlogs.planetrdf.com/swig/2009-04-20#T12-36-09) Revision 1.19 2009/04/20 12:36:31 timbl Add Event (edited ages ago and never checked in), and location (following discussion http://chatlogs.planetrdf.com/swig/2009-04-20#T12-36-09) Revision 1.18 2006/02/01 22:01:04 danbri Clarified that lat and long are decimal degrees, and that alt is decimal metres about local reference ellipsoid Revision 1.17 2004/02/06 17:38:12 danbri Fixed a bad commit screwup Revision 1.15 2003/04/19 11:24:08 danbri Fixed the typo even more. Revision 1.14 2003/04/19 11:16:56 danbri fixed a typo Revision 1.13 2003/02/19 22:27:27 connolly relaxed domain constraints on lat/long/alt from Point to SpatialThing Revision 1.12 2003/01/12 01:41:41 danbri Trying local copy of XSLT doc. Revision 1.11 2003/01/12 01:20:18 danbri added a link to morten's xslt rdfs viewer. Revision 1.10 2003/01/11 18:56:49 danbri Removed datatype range from lat and long properties, since they would have required each occurance of the property to mention the datatype. Revision 1.9 2003/01/11 11:41:31 danbri Another typo; repaired rdfs:Property to rdf:Property x4 Revision 1.8 2003/01/11 11:05:02 danbri Added an rdfs:range for each lat/long/alt property, http://www.w3.org/2001/XMLSchema#float Revision 1.7 2003/01/10 20:25:16 danbri Longer rdfs:comment for Point, trying to be Earth-centric and neutral about coordinate system(s) at the same time. Feedback welcomed. Revision 1.6 2003/01/10 20:18:30 danbri Added CVS log comments into the RDF/XML as an rdfs:comment property of the vocabulary. Note that this is not common practice (but seems both harmless and potentially useful). revision 1.…
label: geo

lat/long
comment: A comma-separated representation of a latitude, longitude coordinate.