ERA vocabulary
type: Ontology
imports: geosparql#
license: https://creativecommons.org/licenses/by/4.0/
author: Edna Ruckhaus
author: Oscar Corcho
contributor: me
contributor: Ivo Velitchkov
contributor: Marina Aguado
contributor: Polymnia Vasilopoulou
contributor: Wouter Beek
issued: 2020-07-29
modified: 2023-03-29
publisher: European Union Agency for Railways
comment: This is the human and machine readable Vocabulary/Ontology governed by the European Union Agency for Railways (https://www.era.europa.eu/). It represents the concepts and relationships linked to the sectorial legal framework and the use cases under the Agency´s remit, as described in the Commission Implementing Regulation (EU) [to be updated after publication] on the common specifications for the register of railway infrastructure [to be updated after publication]. Currently, this vocabulary covers the European railway infrastructure and the vehicles types authorized to operate over it. It is a semantic/browsable representation of the RINF application guide (https://www.era.europa.eu/sites/default/files/registers/docs/rinf_application_guide_for_register_en.pdf) and ERATV application guide (https://www.era.europa.eu/sites/default/files/registers/docs/iu-eratv_application_guide_for_register_2016-797_en.pdf) that were built by domain experts in the RINF and ERATV working parties. The vocabulary also includes the routebook concepts described in appendix D2 "Elements the infrastructure manager has to provide to the railway undertaking for the Route Book" as presented in the Commission Implementing Regulation (EU) [to be updated after publication] 2019/773 of 16 May 2019 on the technical specification for interoperability relating to the operation and traffic management subsystem of the rail system within the European Union and [to be updated after publication] and the Appendix D3 [to be updated after publication].
prior version: https://git.fpfis.eu/datateam/ERA/era-vocabulary/-/releases/v2.6.3
version info: v3.0.0
version URI: https://git.fpfis.eu/datateam/ERA/era-vocabulary/-/releases/v3.0.0

XML name
type: AnnotationProperty
created: 2023-05-26
comment: Corresponding XML name as indicated in the RINF application guide: https://www.era.europa.eu/sites/default/files/registers/docs/rinf_application_guide_for_register_en.pdf

Appendix D2 index
type: AnnotationProperty
comment: The index of a vocabulary term in Appendix D2 Elements the infrastructure manager has to provide to the railway undertaking for the Route Book from the document Commission Implementing Regulation (EU) 2019/773 of 16 May 2019 on the technical specification for interoperability relating to the operation and traffic management subsystem of the rail system within the European Union and repealing Decision 2012/757/EU.

Appendix D3 index
type: AnnotationProperty
created: 2022-11-04
comment: The index of a vocabulary term in Appendix D3 ERTMS trackside engineering information relevant to operation that the infrastructure manager shall provide to the railway undertaking.
term status: stable

Canonical URI
type: AnnotationProperty
created: 2022-12-13
comment: The canonical URI is defined for each instance of a Feature, e.g. section of line, operational point. URIs generated through RML mappings include a part with the validity start and end dates. The canonical URI is the URI stripped of its validity start and end dates during the post-processing of the RDF file.
range: anyURI
domain: ERA Feature

ERATV index
type: AnnotationProperty
created: 2020-11-03
modified: 2020-11-03
comment: Index code used in the original definition of a parameter in ERATV.
term status: stable

in SKOS Concept Scheme
type: AnnotationProperty
created: 2022-11-17
comment: Property that links an object SKOS property to a the URI of the corresponding SKOS Concept Scheme.
term status: stable
range: anyURI

RINF index
type: AnnotationProperty
created: 2020-11-03
modified: 2020-11-03
comment: Index code used in the original definition of a parameter in RINF.
term status: stable

Parameter is used in Route Compatibility Check (RCC) calculations
type: AnnotationProperty
created: 2023-04-12
comment: Indicates whether a RINF parameter is used in Route Compatibility Check calculations according to Commission Implementing Regulation (EU) 2019/773 of 16 May 2019 on the technical specification for interoperability relating to the operation and traffic management subsystem of the rail system within the European Union and repealing Decision. https://eur-lex.europa.eu/eli/reg_impl/2019/773/oj#:~:text=Commission%20Implementing%20Regulation.
range: boolean

altitude
type: AnnotationProperty
comment: The WGS84 altitude of a SpatialThing (decimal meters above the local reference ellipsoid).
domain: SpatialThing

latitude
type: AnnotationProperty
comment: The WGS84 latitude of a SpatialThing (decimal degrees).
domain: SpatialThing

Location
type: AnnotationProperty
sub property of: based near
range: SpatialThing
type: ObjectProperty
RINF index: 1.1.0.0.1.1
RINF index: 1.1.1.0.1.1
RINF index: 1.1.1.3.14.6
RINF index: 1.2.0.0.0.5
RINF index: 1.2.1.0.8.5
used in RCC calculations: true
comment: The relation between something and the point, or other geometrical thing in space, where it is. For example, the realtionship between a radio tower and a Point with a given lat and long. Or a relationship between a park and its outline as a closed arc of points, or a road and its location as a arc (a sequence of points). Clearly in practice there will be limit to the accuracy of any such statement, but one would expect an accuracy appropriate for the size of the object and uses such as mapping .

longitude
type: AnnotationProperty
comment: The WGS84 longitude of a SpatialThing (decimal degrees).
domain: SpatialThing

Existence and TSI compliance of rules for magnetic fields emitted by a vehicle
type: ObjectProperty
type: FunctionalProperty
domain: Class
  union of: Subset with common characteristics
  union of: Track
range: Concept
XML name: CEI_TSIMagneticFields
in SKOS Concept Scheme: TSICompliances
RINF index: 1.1.1.3.9.1
RINF index: 1.2.1.1.8.1
created: 2021-08-09
modified: 2021-09-12
comment: Indication whether rules exist and are compliant with the TSI. The allowed values for this property belong to the SKOS Concept Scheme http://data.europa.eu/949/concepts/tsi-compliances/TSICompliances.
term status: stable

Existence and TSI compliance of limits in harmonics in the traction current of vehicles
type: ObjectProperty
type: FunctionalProperty
domain: Class
  union of: Subset with common characteristics
  union of: Track
range: Concept
XML name: CEI_TSITractionHarmonics
in SKOS Concept Scheme: TSICompliances
RINF index: 1.1.1.3.9.2
RINF index: 1.2.1.1.8.2
created: 2021-08-09
modified: 2021-09-12
comment: Indication whether rules exist and are compliant with the TSI. The allowed values for this property belong to the SKOS Concept Scheme http://data.europa.eu/949/concepts/tsi-compliances/TSICompliances.
term status: stable

ATO communication system
type: ObjectProperty
domain: Class
  union of: Subset with common characteristics
  union of: Track
range: Concept
RINF index: 1.1.1.3.13.3
RINF index: 1.2.1.1.10.3
created: 2023-03-14
comment: Supported ATO communication systems from trackside. The allowed values for this property belong to a SKOS Concept Scheme.
term status: unstable

ATO Grade of Automation
type: ObjectProperty
domain: Class
  union of: Subset with common characteristics
  union of: Track
range: Concept
RINF index: 1.1.1.3.13.1
RINF index: 1.2.1.1.10.1
created: 2023-03-14
comment: ATO grade of automation installed lineside. The allowed values for this property belong to a SKOS Concept Scheme.
term status: unstable

ATO System version
type: ObjectProperty
domain: Class
  union of: Subset with common characteristics
  union of: Track
range: Concept
RINF index: 1.1.1.3.13.2
RINF index: 1.2.1.1.10.2
created: 2023-03-14
comment: ATO system version according to the specification referenced in Appendix A-1, index [C]. The allowed values for this property belong to a SKOS Concept Scheme.
term status: unstable

Authorized country
type: ObjectProperty
domain: Vehicle Type
range: Concept
in SKOS Concept Scheme: country
created: 2020-09-30
modified: 2020-09-30
comment: Indicates the country(ies) in where a vehicle type has been authorized to operate. The allowed values for this property belong to the SKOS Concept Scheme http://publications.europa.eu/resource/authority/country
term status: stable

Axle bearing condition monitoring
type: ObjectProperty
domain: Vehicle Type
range: Concept
ERATV index: 4.9.2
in SKOS Concept Scheme: AxleBearingMonitoring
created: 2020-08-24
modified: 2021-08-02
comment: Axle bearing condition monitoring. The allowed values for this property belong to the SKOS Concept Scheme http://data.europa.eu/949/concepts/axle-monitoring/AxleBearingMonitoring
term status: stable

Border point of
type: ObjectProperty
inverse of: Border point information per country
domain: Operational Point
range: Operational Point
created: 2023-01-20
comment: Relates the information that each country maintains on a border point, to the operational point that represents the general information on the border point.
term status: stable

Cant Deficiency used for the basic SSP
type: ObjectProperty
domain: Class
  union of: Subset with common characteristics
  union of: Track
range: Concept
RINF index: 1.1.1.3.2.14
RINF index: 1.2.1.1.1.14
created: 2023-03-14
comment: Essential information for drivers of trains with a worse (lower) tolerated cant deficiency than those for which the ETCS trackside provides SSP (Static Speed Profiles) in conjunction with 1.1.1.3.2.14.1 According to the specification referenced in Appendix A-1, index [C].
term status: stable

Vehicle category
type: ObjectProperty
type: FunctionalProperty
domain: Vehicle Type
range: Concept
ERATV index: 1.4
in SKOS Concept Scheme: Categories
created: 2020-07-29
modified: 2021-08-03
comment: Vehicle category. The allowed values for this property belong to the SKOS Concept Scheme http://data.europa.eu/949/concepts/vehicle-types/Categories.
term status: stable

Certificate
type: ObjectProperty
domain: Vehicle Type
range: Certificate
created: 2022-06-15
modified: 2022-11-15
comment: Denotes a certificate for this particular vehicleType.
term status: stable

Company code category
type: ObjectProperty
range: Concept
in SKOS Concept Scheme: CompanyCodeCategories
created: 2023-04-04
comment: Category of a Railway company. Can be Infrastructure, Freight or Passenger. The allowed values for this property belong to the SKOS concept scheme http://data.europa.eu/949/concepts/company-code-categories/CompanyCodeCategories
term status: stable

Conditions for use of reflective plates
type: ObjectProperty
domain: Class
  union of: Subset with common characteristics
  union of: Track
range: Concept
RINF index: 1.1.1.1.7.12.1
created: 2023-03-14
comment: Details of any conditions for using the reflective plates on freight corridors. Specific case for Portugal and Spain until 1.1.2025 and Belgium and France until 1.1.2026. The allowed values for this property belong to a SKOS Concept Scheme.
term status: unstable

Contact line system
type: ObjectProperty
domain: Class
  union of: Subset with common characteristics
  union of: Track
range: Contact Line System
created: 2020-08-24
modified: 2021-09-11
comment: Contact line system present in the section of line.
term status: stable

Type of contact line system
type: ObjectProperty
domain: Contact Line System
range: Concept
XML name: ECS_SystemType
in SKOS Concept Scheme: ContactLineSystems
RINF index: 1.1.1.2.2.1.1
used in RCC calculations: true
created: 2021-08-06
modified: 2021-08-06
comment: Indication of the type of the contact line system. The allowed values for this property belong to the SKOS Concept Scheme http://data.europa.eu/949/concepts/contact-line-systems/ContactLineSystems
term status: stable

Permitted contact strip material
type: ObjectProperty
domain: Class
  union of: Subset with common characteristics
  union of: Track
  union of: Vehicle Type
range: Concept
XML name: EPA_StripMaterial
ERATV index: 4.10.10
in SKOS Concept Scheme: ContactStripMaterials
RINF index: 1.1.1.2.3.4
used in RCC calculations: true
created: 2020-08-25
modified: 2021-09-12
comment: Indication of which contact strip materials are permitted to be used. The allowed values for this property belong to the SKOS Concept Scheme http://data.europa.eu/949/concepts/contact-strip-materials/ContactStripMaterials
term status: stable

Data GSM-R network
type: ObjectProperty
type: FunctionalProperty
domain: Vehicle Type
range: Concept
ERATV index: 4.13.2.11
in SKOS Concept Scheme: GSMRNetworks
created: 2020-08-31
modified: 2021-08-02
comment: Data SIM Card GSM-R Home Network. The allowed values for this property belong to the SKOS Concept Scheme http://data.europa.eu/949/concepts/gsmr-networks/GSMRNetworks
term status: stable

Radio system compatibility data
type: ObjectProperty
domain: Class
  union of: Subset with common characteristics
  union of: Track
  union of: Vehicle Type
range: Concept
XML name: CRG_RadioCompData
ERATV index: 4.13.2.8
in SKOS Concept Scheme: RadioSystemCompatibilitiesData
RINF index: 1.1.1.3.3.10
RINF index: 1.2.1.1.2.10
created: 2020-08-31
modified: 2021-09-12
comment: Radio requirements used for demonstrating technical compatibility data. The allowed values for this property belong to the SKOS Concept Scheme http://data.europa.eu/949/concepts/radio-system-compatibilities-data/RadioSystemCompatibilitiesData.
term status: stable

Defines subset
type: ObjectProperty
domain: Infrastructure manager
range: Subset with common characteristics
created: 2022-11-04
modified: 2023-03-14
comment: For the purposes of the register of infrastructure, each infrastructure manager may describe its railway network optionally via common characteristic subsets.
term status: stable

Use of eddy current brakes
type: ObjectProperty
type: FunctionalProperty
domain: Class
  union of: Subset with common characteristics
  union of: Track
range: Concept
XML name: ILR_EddyCurrentBrakes
Appendix D2 index: 3.4.5
in SKOS Concept Scheme: EddyCurrentBraking
RINF index: 1.1.1.1.6.2
RINF index: 1.2.1.0.4.2
used in RCC calculations: true
created: 2020-08-24
modified: 2022-09-06
source: oj
comment: Indication of limitations on the use of eddy current brakes. The allowed values for this property belong to the SKOS Concept Scheme http://data.europa.eu/949/concepts/eddy-current-braking/EddyCurrentBraking This property has been modified to be a RINF parameter (its eratvIndex is deleted). It is treated as a SKOS by RINF and as a boolean by ERATV. A new ERATV datatype property has been defined, eddyCurrentBrakingFitted with boolean values. In https://eur-lex.europa.eu/eli/reg_impl/2019/773/oj 3.4.5 Permissibility to use Eddy-current brake.
term status: stable

Element A
type: ObjectProperty
domain: Net Relation
range: Net Element
RINF index: 1.1.1.0.1.2
RINF index: 1.2.4.1
created: 2021-04-01
modified: 2023-03-14
comment: References the first topological object in an oriented relation. Indicates the object that corresponds to a section of line, an operational point or a track inside an operational point connected at start.
term status: stable
alternative label: Internal connection

Element B
type: ObjectProperty
domain: Net Relation
range: Net Element
RINF index: 1.1.1.0.1.2
RINF index: 1.2.4.1
created: 2021-04-01
modified: 2023-03-14
comment: References the second topological object in an oriented relation. Indicates the object that corresponds to a section of line, an operational point or a track inside an operational point connected at end.
term status: stable
alternative label: Internal connection

Element part
type: ObjectProperty
domain: Net Element
range: Net Element
created: 2021-04-01
modified: 2021-04-01
comment: References the topology object of a higher-granularity level which contains a lower-granularity topology object.
term status: stable

End coupling type
type: ObjectProperty
domain: Vehicle Type
range: Concept
ERATV index: 4.9.1
in SKOS Concept Scheme: EndCouplingType
created: 2021-08-31
modified: 2021-08-31
comment: Type of end coupling (indicating tensile and compressive forces). The allowed values for this property belong to the SKOS Concept Scheme http://data.europa.eu/949/concepts/end-coupling-type/EndCouplingType.
term status: stable

End of tunnel
type: ObjectProperty
sub property of: hasGeometry
sub property of: Location
domain: Tunnel
range: Class
  union of: Geometry
  union of: Point
XML name: SOLTunnelEnd
RINF index: 1.1.1.1.8.4
created: 2020-07-29
modified: 2021-08-11
comment: Geographical coordinates in decimal degrees and km of the line at the end of a tunnel.
term status: stable

Energy supply system
type: ObjectProperty
domain: Class
  union of: Contact Line System
  union of: Vehicle Type
range: Concept
XML name: ECS_VoltFreq
Appendix D2 index: 3.3.1
ERATV index: 4.10.1
in SKOS Concept Scheme: EnergySupplySystems
RINF index: 1.1.1.2.2.1.2
used in RCC calculations: true
created: 2020-08-24
modified: 2021-08-06
source: oj
comment: Indication of the traction supply system (nominal voltage and frequency). The allowed values for this property belong to the SKOS Concept Scheme http://data.europa.eu/949/concepts/energy-supply-systems/EnergySupplySystems In https://eur-lex.europa.eu/eli/reg_impl/2019/773/oj 3.3.1 Energy supply system (voltage and frequency).
term status: stable

ETCS baseline
type: ObjectProperty
domain: Class
  union of: ETCS Level
  union of: Vehicle Type
range: Concept
XML name: CPE_Baseline
ERATV index: 4.13.1.2
in SKOS Concept Scheme: ETCSBaselines
RINF index: 1.1.1.3.2.2
RINF index: 1.2.1.1.1.2
created: 2021-08-07
modified: 2021-08-31
comment: ETCS baseline installed lineside. The allowed values for this property belong to the SKOS Concept Scheme http://data.europa.eu/949/concepts/etcs-baselines/ETCSBaselines
term status: stable

ETCS level for degraded situation
type: ObjectProperty
domain: Class
  union of: Subset with common characteristics
  union of: Track
range: Concept
XML name: CLD_ETCSSituation
Appendix D2 index: 3.1.7
in SKOS Concept Scheme: ETCSSituations
RINF index: 1.1.1.3.10.1
RINF index: 1.2.1.1.9.1
created: 2021-08-09
modified: 2021-09-12
source: oj
comment: ERTMS / ETCS application level for degraded situation related to the track side equipment. The allowed values for this property belong to the SKOS Concept Scheme http://data.europa.eu/949/concepts/etcs-situation/ETCSSituations In https://eur-lex.europa.eu/eli/reg_impl/2019/773/oj 3.1.7 Means of Communication with the traffic management/control centre in normal, degraded and emergency situation.
term status: stable

ETCS equipment level
type: ObjectProperty
type: FunctionalProperty
domain: Vehicle Type
range: Concept
ERATV index: 4.13.1.1
in SKOS Concept Scheme: ETCSEquipmentLevels
created: 2021-08-31
modified: 2021-08-31
comment: ETCS equipment on-board and its level. The allowed values for this property belong to the SKOS Concept Scheme http://data.europa.eu/949/concepts/etcs-equipment-on-board-level/ETCSEquipmentLevels.
term status: stable

ETCS infill installed lineside
type: ObjectProperty
type: FunctionalProperty
domain: Class
  union of: Subset with common characteristics
  union of: Track
  union of: Vehicle Type
range: Concept
XML name: CPE_InfillLineSide
ERATV index: 4.13.1.3
in SKOS Concept Scheme: ETCSInfills
RINF index: 1.1.1.3.2.4
RINF index: 1.2.1.1.1.4
created: 2021-08-08
modified: 2021-09-12
comment: Information about installed trackside equipment capable to transmit infill information by loop or Global System for Mobile communications for Railways (GSM-R) for level 1 installations.
term status: stable

Etcs level
type: ObjectProperty
domain: Class
  union of: Subset with common characteristics
  union of: Track
range: ETCS Level
RINF index: 1.2.1.1.1.1
created: 2021-08-07
modified: 2021-09-12
comment: ETCS application level related to the track side equipment. The allowed values for this property belong to the SKOS Concept Scheme http://data.europa.eu/949/concepts/etcs-levels/ETCSLevels
term status: stable

ETCS level type
type: ObjectProperty
domain: ETCS Level
range: Concept
XML name: CPE_Level
in SKOS Concept Scheme: ETCSLevels
RINF index: 1.1.1.3.2.1
RINF index: 1.2.1.1.1.1
created: 2021-08-07
modified: 2021-08-07
comment: ETCS application level related to the track side equipment. The allowed values for this property belong to the SKOS Concept Scheme http://data.europa.eu/949/concepts/etcs-levels/ETCSLevels
term status: stable

ETCS M_version
type: ObjectProperty
type: FunctionalProperty
domain: Class
  union of: Subset with common characteristics
  union of: Track
range: Concept
XML name: CPE_MVersion
in SKOS Concept Scheme: ETCSMVersions
RINF index: 1.1.1.3.2.10
RINF index: 1.2.1.1.1.10
used in RCC calculations: true
created: 2021-08-08
modified: 2021-09-12
comment: ETCS M_version according to the specification referenced in Appendix A-1, index [C]. The allowed values for this property belong to the SKOS Concept Scheme http://data.europa.eu/949/concepts/etcs-m-versions/ETCSMVersions
term status: stable

ETCS system compatibility
type: ObjectProperty
domain: Class
  union of: Track
  union of: Vehicle Type
range: Concept
XML name: CPE_SystemCompatibility
ERATV index: 4.13.1.8
in SKOS Concept Scheme: ETCSSystemCompatibilities
RINF index: 1.1.1.3.2.9
RINF index: 1.2.1.1.1.9
used in RCC calculations: true
created: 2020-08-31
modified: 2021-09-12
comment: ETCS requirements used for demonstrating technical compatibility. The allowed values for this property belong to the SKOS Concept Scheme http://data.europa.eu/949/concepts/etcs-system-compatibilities/ETCSSystemCompatibilities
term status: stable

Track conditions which can be transmitted
type: ObjectProperty
domain: Class
  union of: Subset with common characteristics
  union of: Track
range: Concept
Appendix D3 index: 1.1
RINF index: 1.1.1.3.2.12.1
RINF index: 1.2.1.1.1.12.1
created: 2022-11-16
modified: 2023-03-14
comment: According to the specification referenced in Appendix A-1, index [C]. In https://www.era.europa.eu/sites/default/files/filesystem/ertms/ccs_tsi_annex_a_-_mandatory_specifications/set_of_specifications_3_etcs_b3_r2_gsm-r_b1/index004_-_subset-026_v360.zip Chapter 5, section 5.18.1.1. The allowed values for this property belong to a SKOS Concept Scheme.
term status: unstable

Fire safety category
type: ObjectProperty
type: FunctionalProperty
domain: Vehicle Type
range: Concept
ERATV index: 4.4.1
in SKOS Concept Scheme: Categories
created: 2020-08-29
modified: 2021-08-03
comment: Fire safety category for tunnels. The allowed values for this property belong to the SKOS Concept Scheme http://data.europa.eu/949/concepts/rolling-stock-fire/Categories.
term status: stable

Part of a Railway freight corridor
type: ObjectProperty
domain: Class
  union of: Subset with common characteristics
  union of: Track
range: Concept
XML name: IPP_FreightCorridor
in SKOS Concept Scheme: FreightCorridors
RINF index: 1.1.1.1.2.3
RINF index: 1.2.1.0.2.3
created: 2021-08-03
modified: 2023-03-14
comment: Indication whether the line is designated to a Railway Freight Corridor. The allowed values for this property belong to the SKOS Concept Scheme http://data.europa.eu/949/concepts/freight-corridor/FreightCorridors
term status: stable

Section with train detection limitation, only for the French network
type: ObjectProperty
domain: Train Detection System
range: Concept
XML name: CTD_TCLimitation
in SKOS Concept Scheme: FrenchTrainDetectionSystemLimitations
RINF index: 1.1.1.3.7.1.4
RINF index: 1.2.1.1.6.3
created: 2020-08-24
is replaced by: Section with train detection limitation is applicable, only for the French network
is replaced by: Section with train detection limitation number, only for French network
is replaced by: Section with train detection limitation, only for the French network
modified: 2022-04-05
comment: Specific for route compatibility check on French network. The allowed values for this property belong to the SKOS Concept Scheme http://data.europa.eu/949/concepts/train-detection/FrenchTrainDetectionSystemLimitations. Deprecated because of replacement by a class, an object property and two datatype properties. The reason is that the property is composed of two values: A boolean [Y/N] and a number N is between 1 and 8.
deprecated: true
term status: stable

Section with train detection limitation number, only for French network
type: ObjectProperty
domain: Section with train detection limitation, only for the French network
range: Concept
XML name: CTD_TCLimitation
in SKOS Concept Scheme: FrenchTrainDetectionSystemLimitationNumbers
RINF index: 1.1.1.3.7.1.4
used in RCC calculations: true
created: 2023-04-05
comment: Part of the section with train detection limitation that indicates the type of train detection limitation. The allowed values for this property belong to the SKOS Concept Scheme http://data.europa.eu/949/concepts/train-detection-numbers/FrenchTrainDetectionSystemLimitationNumbers.
term status: stable

Frequency bands for detection
type: ObjectProperty
domain: Train Detection System
range: Concept
RINF index: 1.1.1.3.4.2
RINF index: 1.2.1.1.3.2
created: 2023-03-14
comment: Bands of the frequency management of the train detection systems as defined in the specification referenced in Appendix A-1, index [D], and in the specific cases or technical documents referred to in Article 13 of TSI CCS when they are available. The allowed values for this property belong to a SKOS Concept Scheme.
term status: unstable

Gauging
type: ObjectProperty
domain: Class
  union of: Subset with common characteristics
  union of: Track
  union of: Vehicle Type
range: Concept
XML name: ILL_Gauging
ERATV index: 4.2.1
in SKOS Concept Scheme: GaugingProfiles
RINF index: 1.1.1.1.3.1.1
RINF index: 1.2.1.0.3.4
used in RCC calculations: true
created: 2020-07-29
modified: 2023-03-14
comment: Gauges as defined in European standard or other local gauges, including lower or upper part. In accordance with point 7.3.2.2 of LOC&PAS TSI, sections of lines of the United Kingdom of Great Britain network may not have gauge reference profile. The allowed values for this property belong to the SKOS Concept Scheme http://data.europa.eu/949/concepts/gaugings/GaugingProfiles
term status: stable

gsmRActiveMobiles
type: ObjectProperty
type: FunctionalProperty
domain: Class
  union of: Subset with common characteristics
  union of: Track
range: Concept
XML name: CRG_NumActiveMob
in SKOS Concept Scheme: NumberActiveMobiles
RINF index: 1.1.1.3.3.2
RINF index: 1.2.1.1.2.2
created: 2021-08-08
modified: 2021-09-12
comment: Number of simultaneous communication session on board for ETCS level R required for a smooth running of the train. This relates to the radio block centre (RBC) handling of communication sessions. Not safety critical and no matter of interoperability. The allowed values for this property belong to the SKOS Concept Scheme http://data.europa.eu/949/concepts/gsmr-number-active-mobiles/NumberActiveMobiles
label: Number of active GSM-R mobiles (EDOR) or simultaneous communication session on-board for ETCS Level 2 (or level 3) needed to perform radio block centre handovers without having an operational disruption
term status: stable

Optional GSM-R functions
type: ObjectProperty
domain: Class
  union of: Subset with common characteristics
  union of: Track
range: Concept
XML name: CRG_OptionalFunctions
in SKOS Concept Scheme: OptionalFunctions
RINF index: 1.1.1.3.3.3
RINF index: 1.2.1.1.2.3
created: 2021-08-08
modified: 2021-09-12
comment: Use of optional GSM-R functions which might improve operation on the line. They are for information only and not for network access criteria. The allowed values for this property belong to the SKOS Concept Scheme http://data.europa.eu/949/concepts/gsmr-optional-functions/OptionalFunctions
term status: stable

GSM-R radio data communication
type: ObjectProperty
type: FunctionalProperty
domain: Vehicle Type
range: Concept
ERATV index: 4.13.2.7
in SKOS Concept Scheme: GSMRRadioDataCommunications
created: 2021-08-31
modified: 2021-08-31
comment: GSM-R Radio Data communication on board and its Baseline. The allowed values for this property belong to the SKOS Concept Scheme http://data.europa.eu/949/concepts/gsm-r-radio-data-communication/GSMRRadioDataCommunications.
term status: stable

GSM-R version
type: ObjectProperty
type: FunctionalProperty
domain: Class
  union of: Subset with common characteristics
  union of: Track
  union of: Vehicle Type
range: Concept
XML name: CRG_Version
ERATV index: 4.13.2.1
in SKOS Concept Scheme: GSMRVersions
RINF index: 1.1.1.3.3.1
RINF index: 1.2.1.1.2.1
created: 2021-08-08
modified: 2021-09-12
comment: GSM-R functional requirements specification and system requirements specification in accordance with the specification respectively referenced in Appendix A-1, index [E] and index [F], version number installed lineside. The allowed values for this property belong to the SKOS Concept Scheme http://data.europa.eu/949/concepts/gsmr-versions/GSMRVersions
term status: stable

Specific constraints imposed by the GSM-R network operator on ETCS on-board units only able to operate in circuit-switch
type: ObjectProperty
domain: Class
  union of: Subset with common characteristics
  union of: Track
range: Concept
Appendix D3 index: 2.2
RINF index: 1.2.1.1.2.12
created: 2023-03-14
comment: These constraints, where applicable, are meant to manage the limited number of circuit-switched radio connections that can be handled simultaneously by a Radio Block Center. The allowed values for this property are taken from a SKOS concept scheme.
term status: stable

GSM-R networks covered by a roaming agreement
type: ObjectProperty
domain: Class
  union of: Subset with common characteristics
  union of: Track
range: Concept
XML name: CRG_RoamingAgreement
in SKOS Concept Scheme: GSMRNetworks
RINF index: 1.1.1.3.3.5
RINF index: 1.2.1.1.2.5
used in RCC calculations: true
created: 2020-08-31
modified: 2021-09-12
comment: List of GSM-R networks which are covered by a roaming agreement. The allowed values for this property belong to the SKOS Concept Scheme http://data.europa.eu/949/concepts/gsmr-networks/GSMRNetworks
term status: stable

Has abstraction
type: ObjectProperty
inverse of: Has implementation
domain: Infrastructure object
range: Net Element
created: 2020-07-29
modified: 2022-10-27
comment: Property that links a physical entity with its topological abstraction representation.
term status: stable

Has implementation
type: ObjectProperty
domain: Net Element
range: Infrastructure object
created: 2020-07-29
modified: 2022-10-27
comment: Property that links a topological abstraction entity with its physical representation.
term status: stable

Has signal
type: ObjectProperty
domain: Net Element
range: Signal
created: 2021-04-01
modified: 2022-11-15
comment: References a signal associated with a topology object.
comment: The reason for deprecation is that it is a property of era:netElement and signals are not part of the topological layer but of the physical layer.
deprecated: true
term status: stable

Hot axle box detector direction
type: ObjectProperty
sub property of: topObjectProperty
domain: Class
  union of: Subset with common characteristics
  union of: Track
range: Concept
XML name: IHS_HABDDirecton
in SKOS Concept Scheme: HotAxleBoxDetectorDirections
RINF index: 1.1.1.1.7.9
used in RCC calculations: true
created: 2022-07-08
comment: Specific for the French Italian and Swedish networks. Applicable if trackside HABD is not TSI compliant, direction of measurement of trackside Hot Axle Box Detector. If the direction of measurement is: — the same as the direction defined by the start and end of the SoL: (N) — the opposite to the direction defined by the start and end of the SoL: (O) — both directions: (B). This property was previously a datatype property with domain Track and range string. As its values are a list of three predefined values, it is now a SKOS. The allowed values for this property belong to the SKOS Concept Scheme http://data.europa.eu/949/concepts/hot-axle/HotAxleBoxDetectorDirections
term status: stable

In country
type: ObjectProperty
domain: Infrastructure object
range: Concept
in SKOS Concept Scheme: country
created: 2020-09-01
modified: 2020-11-20
comment: Indicates the country in which an entity resides. The allowed values for this property belong to the SKOS Concept Scheme http://publications.europa.eu/resource/authority/country
term status: stable

Infrastructure manager
type: ObjectProperty
domain: Infrastructure object
range: Infrastructure manager
created: 2022-07-07
comment: Relates any feature implemented in the European railway infrastructure with its infrastructure manager.
term status: stable

Other radio systems installed (Radio Legacy Systems)
type: ObjectProperty
domain: Class
  union of: Subset with common characteristics
  union of: Track
  union of: Vehicle Type
range: Concept
XML name: CRS_Installed
Appendix D2 index: 3.2.8
ERATV index: 4.13.2.3
in SKOS Concept Scheme: LegacyRadioSystems
RINF index: 1.1.1.3.6.1
RINF index: 1.2.1.1.5.1
used in RCC calculations: true
created: 2020-08-31
modified: 2021-09-12
source: oj
comment: Indication of radio legacy systems installed. The allowed values for this property belong to the SKOS Concept Scheme http://data.europa.eu/949/concepts/legacy-radio-systems/LegacyRadioSystems In https://eur-lex.europa.eu/eli/reg_impl/2019/773/oj 3.2.8 Type of track to train radio equipment.
term status: stable

Category of line
type: ObjectProperty
domain: Class
  union of: Subset with common characteristics
  union of: Track
range: Concept
XML name: IPP_LineCat
in SKOS Concept Scheme: LineCategories
RINF index: 1.1.1.1.2.2
RINF index: 1.2.1.0.2.2
created: 2021-08-02
modified: 2023-03-14
comment: Classification of a line according to the INF TSI. – Commission Regulation (EU) No 1299/2014. In https://eur-lex.europa.eu/legal-content/EN/TXT/HTML/?uri=CELEX:32019R0777&from=EN#ntr3-LI2019139EN.01031601-E0003 The allowed values for this property belong to the SKOS Concept Scheme http://data.europa.eu/949/concepts/line-category/LineCategories
term status: stable

National line identification
type: ObjectProperty
type: FunctionalProperty
domain: Class
  union of: Railway location
  union of: Section Of Line
range: National railway line
XML name: SOLLineIdentification
Appendix D2 index: 2.2.1.1
RINF index: 1.1.0.0.0.2
created: 2020-09-30
modified: 2023-03-14
comment: Unique line identification or unique line number within Member State.
term status: stable

Railway location of Operational point
type: ObjectProperty
domain: Infrastructure object
range: Railway location
created: 2021-01-29
modified: 2023-03-14
comment: Indicates a relationship with a national railway line at a specific kilometer point.
term status: stable

Lineside distance indication appearance
type: ObjectProperty
domain: Class
  union of: Subset with common characteristics
  union of: Track
range: Concept
Appendix D2 index: 3.1.3
RINF index: 1.1.1.0.0.3
created: 2022-10-27
modified: 2023-03-14
source: oj
comment: Indication of types of appearance of track lineside distance indications. The allowed values for this property are taken from a SKOS concept scheme. In https://eur-lex.europa.eu/eli/reg_impl/2019/773/oj 3.1.3 Lineside indications of distance (frequency, appearance and positioning).
term status: unstable

Lineside distance indication positioning
type: ObjectProperty
sub property of: topObjectProperty
domain: Class
  union of: Subset with common characteristics
  union of: Track
range: Concept
Appendix D2 index: 3.1.3
RINF index: 1.1.1.0.0.3
created: 2023-03-14
source: oj
comment: Indication of the side along the track where the lineside indication is positioned (left or right). The allowed values for this property are taken from a SKOS concept scheme. In https://eur-lex.europa.eu/eli/reg_impl/2019/773/oj 3.1.3 Lineside indications of distance (frequency, appearance and positioning).
term status: unstable

Load Capability
type: ObjectProperty
domain: Class
  union of: Subset with common characteristics
  union of: Track
range: Concept
XML name: IPP_LoadCap
in SKOS Concept Scheme: LoadCapabilities
RINF index: 1.1.1.1.2.4
created: 2020-08-24
is replaced by: Load capability
is replaced by: Load capability line category
is replaced by: Load capability speed
is replaced by: Track load capability
modified: 2023-01-20
comment: A combination of the line category and speed at the weakest point of the track. The allowed values for this property belong to the SKOS Concept Scheme http://data.europa.eu/949/concepts/load-capabilities/LoadCapabilities. The reason for deprecation is that the load capability property 1.1.1.1.2.4 was defined incorrectly as a SKOS property. It is composed of two values: (1) line category, and (2) speed. Only line category is a list of predefined values (SKOS), whereas speed is an integer (according to the RINF application guide).
deprecated: true
term status: stable

Load capability line category
type: ObjectProperty
domain: Load capability
range: Concept
XML name: IPP_LoadCap
in SKOS Concept Scheme: LoadCapabilityLineCategories
RINF index: 1.1.1.1.2.4
used in RCC calculations: true
created: 2023-01-20
comment: Part of the load capability of a track that corresponds to the line category of the load model. The load capability is a value selected from the list of load models representing: line category which is amended by value of speed [km/h] permitted for a specific load model. The list of values may also be Route Availability which is amended by value of speed [miles/h] permitted for a specific load model. The allowed values for this property belong to the SKOS Concept Scheme http://data.europa.eu/949/concepts/load-capability-line-categories/LoadCapabilityLineCategories
term status: stable

M_NVCONTACT
type: ObjectProperty
domain: Class
  union of: Subset with common characteristics
  union of: Track
range: Concept
Appendix D3 index: 1.5.9
RINF index: 1.1.1.3.2.16.9
RINF index: 1.2.1.1.1.16.9
created: 2022-11-07
modified: 2023-03-14
comment: On-Board system reaction when T_NVCONTACT expires. According to the specification referenced in Appendix A-1, index [C]. In https://www.era.europa.eu/sites/default/files/filesystem/ertms/ccs_tsi_annex_a_-_mandatory_specifications/set_of_specifications_3_etcs_b3_r2_gsm-r_b1/index004_-_subset-026_v360.zip Subset 26, chapter 7. 7.5.1.74 M_NVCONTACT. The allowed values for this concept belong to a SKOS concept scheme.
term status: unstable

Use of magnetic brakes
type: ObjectProperty
type: FunctionalProperty
domain: Class
  union of: Subset with common characteristics
  union of: Track
range: Concept
XML name: ILR_MagneticBrakes
Appendix D2 index: 3.4.6
in SKOS Concept Scheme: MagneticBraking
RINF index: 1.1.1.1.6.3
RINF index: 1.2.1.0.4.3
used in RCC calculations: true
created: 2020-08-24
modified: 2022-09-12
source: oj
comment: Indication of limitations on the use of magnetic brakes. The allowed values for this property belong to the SKOS Concept Scheme http://data.europa.eu/949/concepts/magnetic-braking/MagneticBraking. This property has been modified to be a RINF parameter (its eratvIndex is deleted). It is treated as a SKOS by RINF and as a boolean by ERATV. A new ERATV datatype property has been defined, magneticBrakingFitted with boolean values. In 3.4.6 https://eur-lex.europa.eu/eli/reg_impl/2019/773/oj Permissibility to use magnetic brake.
term status: stable

Manufacturer
type: ObjectProperty
domain: Vehicle Type
range: Manufacturer
created: 2020-07-29
modified: 2020-11-19
comment: Vehicle manufacturer company.
term status: stable

Manufacturing country
type: ObjectProperty
domain: Class
  union of: Vehicle
  union of: Vehicle Type
range: Concept
in SKOS Concept Scheme: country
created: 2020-09-30
modified: 2020-11-22
comment: Indicates the country in which a vehicle or vehicle type is manufactured. The allowed values for this property belong to the SKOS Concept Scheme http://publications.europa.eu/resource/authority/country
term status: stable

Maximum amount of sand
type: ObjectProperty
domain: Train Detection System
range: Concept
XML name: CTD_MaxSandOutput
in SKOS Concept Scheme: MaxAmountSandings
RINF index: 1.1.1.3.7.17
created: 2021-08-08
modified: 2023-03-14
comment: Deprecated according to the ammendment to the Regulation (EU) 2019/777. Maximum amount of sand accepted on the track within value of sanding output for 30s, given in grams. The allowed values for this property belong to the SKOS Concept Scheme http://data.europa.eu/949/concepts/max-amount-sandings/MaxAmountSandings
deprecated: true
term status: stable

Minimum axle load vehicle category
type: ObjectProperty
domain: Min axle load vehicle category
range: Concept
XML name: CTD_MinAxleLoadByVehicleCat
in SKOS Concept Scheme: MinAxleLoadVehicleCategories
RINF index: 1.1.1.3.7.11.1
created: 2021-08-08
modified: 2023-03-14
comment: Deprecated according to the ammendment to the Regulation (EU) 2019/777. Represents the category of vehicle which is amended by value of minimum permitted axle load [tons] (property minAxleLoad). The allowed values for this property belong to the SKOS Concept Scheme http://data.europa.eu/949/concepts/min-axle-load-vehicle-categories/MinAxleLoadVehicleCategories.
deprecated: true
term status: stable

Navigability
type: ObjectProperty
domain: Net Relation
range: Concept
in SKOS Concept Scheme: Navigabilities
RINF index: 1.1.1.0.1.2
RINF index: 1.2.4.1
created: 2021-04-01
modified: 2021-08-03
source: EA286.html
comment: Indicates the navigation possibilities between two related topological objects. The allowed values for this property belong to the SKOS Concept Scheme http://data.europa.eu/949/concepts/navigabilities/Navigabilities.
term status: stable
alternative label: Internal connection

Net element
type: ObjectProperty
range: Net Element
created: 2021-04-01
modified: 2022-09-06
comment: References an associated topological object. The reason for deprecating this property is that it is defined as "References an associated topological object." and the vocabulary has already a property "hasAbstraction" which relates the implementation layer with the topological layer, https://citnet.tech.ec.europa.eu/CITnet/confluence/pages/viewpage.action?pageId=1122974879.
deprecated: true
term status: stable

Not applicable
type: ObjectProperty
created: 2021-09-13
modified: 2021-09-13
comment: Reference to a property that is not applicable.
term status: unstable

Not yet available
type: ObjectProperty
created: 2021-09-13
modified: 2021-09-13
comment: Reference to a property that is not yet available.
term status: unstable

Operational Point at end of Section of Line
type: ObjectProperty
domain: Section Of Line
range: Operational Point
XML name: SOLOPEnd
Appendix D2 index: 3.1.2
RINF index: 1.1.0.0.0.4
created: 2021-09-09
modified: 2023-03-14
source: oj
comment: Unique OP ID at end of section of line (kilometres increasing from start OP to the end OP). In https://eur-lex.europa.eu/eli/reg_impl/2019/773/oj 3.1.2 Line segment extremity 2.
term status: stable

Border point information per country
type: ObjectProperty
domain: Operational Point
range: Operational Point
created: 2023-01-20
comment: Relates an operational point that represents the general information of a border point to the information that each country maintains for the border point.
term status: stable

Operational Point at start of Section of Line
type: ObjectProperty
domain: Section Of Line
range: Operational Point
XML name: SOLOPStart
Appendix D2 index: 3.1.1
RINF index: 1.1.0.0.0.3
created: 2021-09-09
modified: 2023-03-14
source: oj
comment: Unique OP ID at start of section of line (kilometres increasing from start OP to the end OP). In https://eur-lex.europa.eu/eli/reg_impl/2019/773/oj 3.1.1 Line segment extremity 1.
term status: stable

Type of operational point
type: ObjectProperty
type: FunctionalProperty
domain: Operational Point
range: Concept
XML name: OPType
Appendix D2 index: 2.2.2
Appendix D2 index: 2.3.2
in SKOS Concept Scheme: OperationalPointTypes
RINF index: 1.2.0.0.0.4
created: 2020-07-29
modified: 2021-08-03
source: oj
comment: Type of facility in relation to the dominating operational functions. The allowed values for this property belong to the SKOS Concept Scheme http://data.europa.eu/949/concepts/op-types/OperationalPointTypes. In https://eur-lex.europa.eu/eli/reg_impl/2019/773/oj 2.3.2 Type of location passenger terminal, freight terminal, yard, depot.
term status: stable

Operating language
type: ObjectProperty
range: Concept
Appendix D2 index: 3.5.1
RINF index: 1.1.0.0.1.2
RINF index: 1.2.0.0.0.8
created: 2022-10-28
modified: 2023-03-14
source: oj
comment: The language or languages used in daily operation by infrastructure manager and published in its Network Statement, for the communication of operational or safety related messages between the staff of the infrastructure manager and the railway undertaking. The allowed values for this property belong to a SKOS Concept Scheme. In 3.5.1 https://eur-lex.europa.eu/eli/reg_impl/2019/773/oj Operating language.
term status: unstable

Operational regime type
type: ObjectProperty
type: FunctionalProperty
range: Concept
Appendix D2 index: 3.2.7
RINF index: 1.1.0.0.1.3
created: 2022-10-27
modified: 2023-03-14
source: oj
comment: Double track type. The allowed values for this property belong to a SKOS Concept Scheme. In https://eur-lex.europa.eu/eli/reg_impl/2019/773/oj 3.2.7 Type of signalling system and corresponding operational regime (double track, reversible working, left or right hand running, etc.).
term status: unstable

Operational restriction
type: ObjectProperty
domain: Vehicle
range: Concept
in SKOS Concept Scheme: Restrictions
created: 2020-11-23
modified: 2021-08-03
comment: Indicates an operational restriction of vehicle or wagon. Parking brake type (if the vehicle is fitted with it). The allowed values for this property belong to the SKOS Concept Scheme http://data.europa.eu/949/concepts/restrictions/Restrictions.
term status: stable

Open street map class
type: ObjectProperty
domain: Class
  union of: Subset with common characteristics
  union of: Track
range: Concept
in SKOS Concept Scheme: OSMClasses
term status: stable
definition: Additional concept class according to OpenStreetMap. The allowed values for this property belong to the SKOS Concept Scheme http://data.europa.eu/949/concepts/osmclass/OSMClasses.

Other Cant Deficiency train categories for which the ETCS trackside is configured to provide SSP
type: ObjectProperty
domain: Class
  union of: Subset with common characteristics
  union of: Track
range: Concept
RINF index: 1.1.1.3.2.14.1
RINF index: 1.2.1.1.1.14.1
created: 2023-03-14
comment: Essential information for drivers of trains with a worse (lower) tolerated cant deficiency than those for which the ETCS trackside provides SSP (Static Speed Profiles) in conjunction with 1.1.1.3.2.14. According to the specification referenced in Appendix A-1, index [C].
term status: unstable

Accepted other pantograph heads
type: ObjectProperty
domain: Class
  union of: Subset with common characteristics
  union of: Track
range: Concept
XML name: EPA_OtherHeads
in SKOS Concept Scheme: OtherPantographHeads
RINF index: 1.1.1.2.3.2
used in RCC calculations: true
created: 2022-06-03
modified: 2022-06-03
comment: Indication of pantograph heads which are allowed to be used. The allowed values for this property belong to the SKOS Concept Scheme http://data.europa.eu/949/concepts/other-pantograph-heads/OtherPantographHeads.
term status: stable

Other train protection, control and warning systems for degraded situation
type: ObjectProperty
type: FunctionalProperty
domain: Class
  union of: Subset with common characteristics
  union of: Track
range: Concept
XML name: CLD_OtherProtectControlWarn
in SKOS Concept Scheme: OtherProtectionControlWarnings
RINF index: 1.1.1.3.10.2
RINF index: 1.2.1.1.9.2
created: 2021-08-09
modified: 2021-09-12
comment: Indication of existence of other system than ETCS for degraded situation. The allowed values for this property belong to the SKOS Concept Scheme http://data.europa.eu/949/concepts/other-protection-control-warning/OtherProtectionControlWarnings
term status: stable

Parking brake type
type: ObjectProperty
domain: Vehicle Type
range: Concept
ERATV index: 4.7.3.2
in SKOS Concept Scheme: BrakeParkingType
created: 2021-08-26
modified: 2021-08-26
comment: Parking brake type (if the vehicle is fitted with it). The allowed values for this property belong to the SKOS Concept Scheme http://data.europa.eu/949/concepts/brake-parking-type/BrakeParkingType.
term status: stable

Passes through tunnel
type: ObjectProperty
domain: Class
  union of: Subset with common characteristics
  union of: Track
range: Tunnel
created: 2020-07-29
modified: 2022-10-27
comment: References a tunnel that a track goes through.
term status: stable

Platform
type: ObjectProperty
domain: Class
  union of: Subset with common characteristics
  union of: Track
range: Platform
created: 2021-08-09
modified: 2021-08-09
comment: Reference to a related platform.
term status: stable

Height of platform
type: ObjectProperty
type: FunctionalProperty
domain: Platform
range: Concept
XML name: IPL_Height
Appendix D2 index: 2.3.7
in SKOS Concept Scheme: PlatformHeights
RINF index: 1.2.1.0.6.5
used in RCC calculations: true
created: 2021-08-02
modified: 2021-08-02
source: oj
comment: Distance between the upper surface of platform and running surface of the neighbouring track. It is the nominal value expressed in millimetres. The allowed values for this property belong to the SKOS Concept Scheme http://data.europa.eu/949/concepts/platform-heights/PlatformHeights In https://eur-lex.europa.eu/eli/reg_impl/2019/773/oj 2.3.7 Height of platforms.
term status: stable

Position on A
type: ObjectProperty
domain: Net Relation
range: Concept
in SKOS Concept Scheme: RelationPositions
RINF index: 1.1.1.0.1.2
RINF index: 1.2.4.1
created: 2021-04-03
modified: 2021-08-03
comment: Determines the position of the topological object A in a relation. The allowed values for this property belong to the SKOS Concept Scheme http://data.europa.eu/949/concepts/relation-positions/RelationPositions.
term status: stable
alternative label: Internal connection

Position on B
type: ObjectProperty
domain: Net Relation
range: Concept
in SKOS Concept Scheme: RelationPositions
RINF index: 1.1.1.0.1.2
RINF index: 1.2.4.1
created: 2021-04-03
modified: 2021-08-03
comment: Determines the position of the topological object B in a relation. The allowed values for this property belong to the SKOS Concept Scheme http://data.europa.eu/949/concepts/relation-positions/RelationPositions.
term status: stable
alternative label: Internal connection

Previous vehicle type
type: ObjectProperty
type: FunctionalProperty
domain: Vehicle Type
range: Vehicle Type
created: 2022-06-15
modified: 2022-06-15
comment: Denotes a the previous VehicleType.
term status: stable

Standard combined transport profile number for semi-trailers
type: ObjectProperty
domain: Class
  union of: Subset with common characteristics
  union of: Track
range: Concept
XML name: ILL_ProfileNumSemiTrailers
in SKOS Concept Scheme: ProfileNumbersSemiTrailers
RINF index: 1.1.1.1.3.5
created: 2021-08-03
modified: 2023-03-14
comment: Coding for combined transport for semi-trailers (for all freight and mixed-traffic lines) in accordance with the specification referenced in Appendix A-1, index [B]. The allowed values for this property belong to the SKOS Concept Scheme http://data.europa.eu/949/concepts/profile-num-semi-trailers/ProfileNumbersSemiTrailers
term status: stable

Standard combined transport profile number for swap bodies
type: ObjectProperty
domain: Class
  union of: Subset with common characteristics
  union of: Track
range: Concept
XML name: ILL_ProfileNumSwapBodies
in SKOS Concept Scheme: ProfileNumbersSwapBodies
RINF index: 1.1.1.1.3.4
created: 2021-08-03
modified: 2023-03-14
comment: Coding for combined transport with swap bodies (for all freight and mixed-traffic lines) in accordance with the specification referenced in Appendix A-1, index [B]
term status: stable

Train protection legacy system
type: ObjectProperty
domain: Class
  union of: Subset with common characteristics
  union of: Track
  union of: Vehicle Type
range: Concept
XML name: CPO_LegacyTrainProtection
ERATV index: 4.13.1.5
in SKOS Concept Scheme: TrainProtectionLegacySystems
RINF index: 1.1.1.3.5.3
RINF index: 1.2.1.1.4.1
used in RCC calculations: true
created: 2020-08-31
modified: 2021-09-12
comment: Indication of which class B system is installed. The allowed values for this property belong to the SKOS Concept Scheme http://data.europa.eu/949/concepts/train-protection-legacy-systems/TrainProtectionLegacySystems
term status: stable

Q_NVDRIVER_ADHES
type: ObjectProperty
domain: Class
  union of: Subset with common characteristics
  union of: Track
range: Concept
Appendix D3 index: 1.5.11
RINF index: 1.1.1.3.2.16.11
RINF index: 1.2.1.1.1.16.11
created: 2023-03-14
comment: Qualifier determining whether the driver is allowed to modify the adhesion factor used by the ETCS on-board to calculate the braking curves. According to the specification referenced in Appendix A-1, index [C]. In https://www.era.europa.eu/sites/default/files/filesystem/ertms/ccs_tsi_annex_a_-_mandatory_specifications/set_of_specifications_3_etcs_b3_r2_gsm-r_b1/index004_-_subset-026_v360.zip Subset 26, chapter 7. 7.5.1.122 Q_NVDRIVER_ADHES. The allowed values for this property belong to a SKOS Concept Scheme.
term status: stable

Q_NVEMRRLS
type: ObjectProperty
domain: Class
  union of: Subset with common characteristics
  union of: Track
range: Concept
Appendix D3 index: 1.5.2
RINF index: 1.1.1.3.2.16.2
RINF index: 1.2.1.1.1.16.2
created: 2023-03-14
comment: Qualifier defining whether the application of the emergency brake for reasons other than a trip can be revoked as soon as the conditions for it have disappeared or after the train has come to a complete standstill. According to the specification referenced in Appendix A-1, index [C]. In https://www.era.europa.eu/sites/default/files/filesystem/ertms/ccs_tsi_annex_a_-_mandatory_specifications/set_of_specifications_3_etcs_b3_r2_gsm-r_b1/index004_-_subset-026_v360.zip Subset 26, chapter 7. 7.5.1.123 Q_NVEMRRLS. The allowed values for this property belong to a SKOS Concept Scheme.
term status: unstable

Quieter route exempted country
type: ObjectProperty
domain: Vehicle
range: Concept
in SKOS Concept Scheme: country
created: 2020-11-23
modified: 2020-11-23
comment: Country where a vehicle may operate without noise restrictions. The allowed values for this property belong to the SKOS Concept Scheme http://publications.europa.eu/resource/authority/country
term status: stable

Rail inclination
type: ObjectProperty
type: FunctionalProperty
domain: Class
  union of: Subset with common characteristics
  union of: Track
  union of: Vehicle Type
range: Concept
XML name: ITP_RailInclination
ERATV index: 4.6.5
in SKOS Concept Scheme: RailInclinations
RINF index: 1.1.1.1.4.3
used in RCC calculations: true
created: 2020-08-24
modified: 2022-10-20
comment: An angle defining the inclination of the head of a rail relative to the running surface. The allowed values for this property belong to the SKOS Concept Scheme http://data.europa.eu/949/concepts/rail-inclinations/RailInclinations This property has been changed, its rinfIndex has been deleted. RINF treats this parameter as an integer. A new datatype property for RINF has been defined called railInclinationMeasurement. This change was rolled back, RINF index was again added.
term status: stable

Reasons for which an ETCS Radio Block Center can reject a train
type: ObjectProperty
domain: Class
  union of: Subset with common characteristics
  union of: Track
range: Concept
Appendix D3 index: 1.4
RINF index: 1.1.1.3.2.15
RINF index: 1.2.1.1.1.15
created: 2022-11-07
modified: 2023-03-14
comment: List of cases subject to system design choices made by the infrastructure manager according to the specification referenced in Appendix A-1, index [C]. In https://www.era.europa.eu/sites/default/files/filesystem/ertms/ccs_tsi_annex_a_-_mandatory_specifications/set_of_specifications_3_etcs_b3_r2_gsm-r_b1/index004_-_subset-026_v360.zip Subset 26, Chapter 5 5.4 Procedure start of mission. The allowed values for this property belong to a SKOS Concept Scheme.
term status: unstable

Fire category of rolling stock required
type: ObjectProperty
type: FunctionalProperty
domain: Tunnel
range: Concept
XML name: ITU_FireCatReq
Appendix D2 index: 3.2.3
in SKOS Concept Scheme: Categories
RINF index: 1.1.1.1.8.10
RINF index: 1.2.1.0.5.7
RINF index: 1.2.2.0.5.7
used in RCC calculations: true
created: 2020-07-29
modified: 2021-08-10
source: oj
comment: Categorisation how a passenger train with a fire on board will continue to operate for a defined time period. The allowed values for this property belong to the SKOS Concept Scheme http://data.europa.eu/949/concepts/rolling-stock-fire/Categories. In https://eur-lex.europa.eu/eli/reg_impl/2019/773/oj 3.2.3 Tunnels: location, name, length, specific information such as the existence of walkways and points of safe egress as well as the location of safe areas where evacuation of passengers may take place; fire safety categorisation.
term status: stable

Safe consist length information from on-board necessary for access the line and SIL
type: ObjectProperty
domain: Class
  union of: Subset with common characteristics
  union of: Track
range: Concept
RINF index: 1.1.1.3.2.11
RINF index: 1.2.1.1.1.11
created: 2023-03-14
comment: Indication whether safe consist train length information from on-board is required to access the line for safety reasons and the required safety integrity level. The allowed values for this property belong to a SKOS Concept Scheme.
term status: stable

Siding
type: ObjectProperty
domain: Operational Point
range: Siding
created: 2021-08-10
modified: 2021-08-10
comment: Reference to a related siding.
term status: stable

Signal orientation
type: ObjectProperty
domain: Signal
range: Concept
RINF index: 1.1.1.3.14.3
RINF index: 1.2.1.0.8.3
created: 2023-03-14
version URI: indication if the signal refers to normal or opposite track direction. The allowed values for this property belong to a SKOS Concept Scheme.
term status: unstable

Type of signal
type: ObjectProperty
domain: Signal
range: Concept
Appendix D2 index: 2.2.3
RINF index: 1.1.1.3.14.2
RINF index: 1.2.1.0.8.2
created: 2022-10-27
modified: 2023-03-14
source: oj
comment: Location, type and name of all fixed signals relevant for trains. The allowed values for this property belong to a SKOS Concept Scheme. In https://eur-lex.europa.eu/eli/reg_impl/2019/773/oj 2.2.3 Location, type and name of all fixed signals relevant for trains.
term status: unstable

Signalling system type
type: ObjectProperty
range: Concept
Appendix D2 index: 3.2.7
RINF index: 1.1.0.0.1.3
created: 2023-03-14
source: oj
comment: Indication of the signalling system type of the signalling system. The allowed values for this property belong to a SKOS Concept Scheme. In https://eur-lex.europa.eu/eli/reg_impl/2019/773/oj 3.2.7 Type of signalling system and corresponding operational regime (double track, reversible working, left or right hand running, etc.). The allowed values for this property belong to a SKOS Concept Scheme.
term status: unstable

Snow ice hail conditions
type: ObjectProperty
type: FunctionalProperty
domain: Vehicle Type
range: Concept
ERATV index: 4.3.3
in SKOS Concept Scheme: IceConditions
created: 2020-08-24
modified: 2021-08-02
comment: Snow, ice and hail conditions. The allowed values for this property belong to the SKOS Concept Scheme http://data.europa.eu/949/concepts/ice-conditions/IceConditions
term status: stable

Nature of Section of Line
type: ObjectProperty
type: FunctionalProperty
domain: Section Of Line
range: Concept
XML name: SOLNature
in SKOS Concept Scheme: SoLNatures
RINF index: 1.1.0.0.0.6
created: 2021-08-08
modified: 2023-03-14
comment: Kind of section of line expressing size of presented data which depends on fact whether it connects OPs generated by division of a big node into several OPs or not. The allowed values for this property belong to the SKOS Concept Scheme http://data.europa.eu/949/concepts/sol-natures/SoLNatures
term status: stable

Special area type
type: ObjectProperty
domain: Special area
range: Concept
Appendix D2 index: 3.2.3
Appendix D2 index: 3.2.4
Appendix D2 index: 3.2.5
Appendix D2 index: 3.2.6
Appendix D2 index: 3.3.5
Appendix D2 index: 3.3.6
RINF index: 1.1.0.0.1.1
created: 2022-10-27
modified: 2023-03-14
comment: Indicates the special area or location types such as safe areas and restricted area types. The allowed values of this property belong to a SKOS concept scheme. In https://eur-lex.europa.eu/eli/reg_impl/2019/773/oj 3.2.3 Tunnels: location, name, length, specific information such as the existence of walkways and points of safe egress as well as the location of safe areas where evacuation of passengers may take place; fire safety categorisation. 3.2.4 Non-stopping areas: identification, location, type. 3.2.5 Industrial risks — locations where it is dangerous for the driver to step out. 3.2.6 Locations of areas designated for testing the sanding equipment (if existing). 3.3.5 Location of neutral sections. 3.3.6 Location of areas that shall be passed with lowered pantographs.
term status: unstable

Special tunnel area
type: ObjectProperty
domain: Tunnel
range: Special tunnel area
Appendix D2 index: 3.2.3
created: 2022-10-27
source: oj
comment: Relates a tunnel with a special area or location. In https://eur-lex.europa.eu/eli/reg_impl/2019/773/oj 3.2.3 Tunnels: location, name, length, specific information such as the existence of walkways and points of safe egress as well as the location of safe areas where evacuation of passengers may take place; fire safety categorisation.
term status: stable

Standard combined transport profile number for roller units
type: ObjectProperty
domain: Class
  union of: Subset with common characteristics
  union of: Track
range: Concept
RINF index: 1.1.1.1.3.9
created: 2023-03-14
comment: Coding for combined transport for roller units (for all freight and mixed-traffic lines) in accordance with the specification referenced in Appendix A-1, index [B]. The allowed values for this property belong to a SKOS Concept Scheme.
term status: unstable

Standard combined transport profile number for containers
type: ObjectProperty
domain: Class
  union of: Subset with common characteristics
  union of: Track
range: Concept
RINF index: 1.1.1.1.3.8
created: 2023-03-14
comment: Coding for combined transport for containers (for all freight and mixed-traffic lines) in accordance with the specification referenced in Appendix A-1, index [B]. The allowed values for this property belong to a SKOS Concept Scheme.
term status: unstable

Start of tunnel
type: ObjectProperty
sub property of: hasGeometry
sub property of: Location
domain: Tunnel
range: Class
  union of: Geometry
  union of: Point
XML name: SOLTunnelStart
RINF index: 1.1.1.1.8.3
created: 2020-07-29
modified: 2021-08-11
comment: References the geolocation of the start of a tunnel.
term status: stable

State
type: ObjectProperty
type: FunctionalProperty
domain: Certificate
range: Concept
in SKOS Concept Scheme: States
created: 2022-06-15
modified: 2022-06-15
comment: Denoting the state of the certificate and range the following instances. The allowed values for this property belong to the SKOS Concept Scheme http://data.europa.eu/949/concepts/states/States.
term status: stable

Vehicle subcategory
type: ObjectProperty
type: FunctionalProperty
domain: Vehicle Type
range: Concept
ERATV index: 1.5
in SKOS Concept Scheme: Categories
created: 2020-07-29
modified: 2021-08-03
comment: Vehicle subcategory. The allowed values for this property belong to the SKOS Concept Scheme http://data.europa.eu/949/concepts/vehicle-types/Categories.
term status: stable

Supported platform height
type: ObjectProperty
domain: Vehicle Type
range: Concept
ERATV index: 4.12.3.1
in SKOS Concept Scheme: PlatformHeights
created: 2020-07-29
modified: 2021-08-02
comment: Platform height for which the vehicle is de­signed. The allowed values for this property belong to the SKOS Concept Scheme http://data.europa.eu/949/concepts/platform-heights/PlatformHeights
term status: stable

Section with train detection limitation, only for the French network
type: ObjectProperty
domain: Train Detection System
range: Section with train detection limitation, only for the French network
XML name: CTD_TCLimitation
RINF index: 1.1.1.3.7.1.4
used in RCC calculations: true
created: 2023-04-05
comment: Relates the class train detection system with the class that represents the section with train detection limitation. Specific for route compatibility check on French network.
term status: stable

Train detection system maximum magnetic field
type: ObjectProperty
domain: Train Detection System
range: Maximum magnetic field
RINF index: 1.1.1.3.4.2.3
RINF index: 1.2.1.1.3.2.3
created: 2023-03-14
comment: Relates the TrainDetectionSystem with the MaximumMagneticField. The maximum magnetic field limits allowed for axle counters (in dBµA/m) for a defined frequency band. It should be provided in 3 directions.
term status: stable

Train detection system min axle load vehicle category
type: ObjectProperty
domain: Train Detection System
range: Min axle load vehicle category
XML name: CTD_MinAxleLoadByVehicleCat
RINF index: 1.1.1.3.7.11.1
created: 2023-01-25
modified: 2023-03-14
comment: Deprecated according to the ammendment to the Regulation (EU) 2019/777. Indication of load given in tons depending of the category of vehicle.
deprecated: true
term status: stable

Temperature range
type: ObjectProperty
domain: Class
  union of: Subset with common characteristics
  union of: Track
range: Concept
XML name: IPP_TempRange
in SKOS Concept Scheme: TemperatureRanges
RINF index: 1.1.1.1.2.6
used in RCC calculations: true
created: 2023-01-20
comment: Temperature range for unrestricted access to the line according European standard. The allowed values for this property belong to the SKOS Concept Scheme http://data.europa.eu/949/concepts/temperature-ranges/TemperatureRanges
term status: stable

TEN classification (of track, of platform, of siding)
type: ObjectProperty
domain: Class
  union of: Platform
  union of: Siding
  union of: Track
range: Concept
XML name: IPL_TENClass
XML name: IPP_TENClass
in SKOS Concept Scheme: TENClassifications
RINF index: 1.1.1.1.2.1
RINF index: 1.2.1.0.2.1
RINF index: 1.2.1.0.6.3
RINF index: 1.2.2.0.0.3
created: 2021-08-02
modified: 2021-09-10
comment: Indication of the part of the trans-European network the line belongs to. The allowed values for this property belong to the SKOS Concept Scheme http://data.europa.eu/949/concepts/ten-classifications/TENClassifications.
term status: stable

Thermal capacity TSI reference
type: ObjectProperty
type: FunctionalProperty
domain: Vehicle Type
range: Concept
ERATV index: 4.7.2.1.1
in SKOS Concept Scheme: ThermalCapacityTSIReferences
created: 2020-08-24
modified: 2021-08-02
comment: Reference case of a TSI thermal capacity. The allowed values for this property belong to the SKOS Concept Scheme http://data.europa.eu/949/concepts/thermal-capacity/ThermalCapacityTSIReferences
term status: stable

Track
type: ObjectProperty
domain: Class
  union of: Operational Point
  union of: Section Of Line
  union of: Signal
range: Track
created: 2021-08-09
modified: 2021-09-09
comment: Reference to a related railway track.
term status: stable

Normal running direction
type: ObjectProperty
type: FunctionalProperty
domain: Track
range: Concept
XML name: SOLTrackDirection
Appendix D2 index: 2.2.1.1
in SKOS Concept Scheme: TrackRunningDirections
RINF index: 1.1.1.0.0.2
created: 2021-09-09
modified: 2023-03-14
comment: The normal running direction is: - The same as the direction defined by the start and end of the SoL: (N) - The opposite to the direction defined by the start and end of the SoL: (O) - Both directions: (B) The allowed values for this property belong to the SKOS Concept Scheme http://data.europa.eu/949/concepts/track-running-directions/TrackRunningDirections.
term status: stable

Track load capability
type: ObjectProperty
sub property of: topObjectProperty
domain: Class
  union of: Subset with common characteristics
  union of: Track
range: Load capability
XML name: IPP_LoadCap
RINF index: 1.1.1.1.2.4
used in RCC calculations: true
created: 2023-01-20
comment: Relates the track with the class LoadCapability. A combination of the line category and speed at the weakest point of the track.
term status: stable

Track phase info
type: ObjectProperty
domain: Class
  union of: Subset with common characteristics
  union of: Track
range: Phase info
XML name: EOS_InfoPhase
RINF index: 1.1.1.2.4.1.2
created: 2023-04-05
comment: Relates the Track with PhaseInfo. Indication of required several information on phase separation.
term status: stable

Track raised pantograph distance and speed
type: ObjectProperty
domain: Class
  union of: Subset with common characteristics
  union of: Track
range: Raised pantographs distance and speed
XML name: EPA_NumRaisedSpeed
RINF index: 1.1.1.2.3.3
used in RCC calculations: true
created: 2023-04-05
comment: Relates the track with the class RaisePantporaphsDistanceAndSpeed. Indication of maximum number of raised pantographs per train allowed and minimum spacing centre line to centre line of adjacent pantograph heads, expressed in metres, at the given speed.
term status: stable

Track system separation info
type: ObjectProperty
domain: Class
  union of: Subset with common characteristics
  union of: Track
range: System separation info
XML name: EOS_InfoSystem
RINF index: 1.1.1.2.4.2.2
created: 2023-04-05
comment: Relates the Track with the SystemSeparationInfo. Indication of required several information on system separation.
term status: stable

Train detection system
type: ObjectProperty
domain: Class
  union of: Subset with common characteristics
  union of: Track
range: Train Detection System
created: 2020-07-29
modified: 2021-09-12
comment: Train detection systems installed in the section of line.
term status: stable

Type of track circuits to which specific checks are needed
type: ObjectProperty
domain: Train Detection System
range: Concept
XML name: CTD_TCCheck
in SKOS Concept Scheme: TrainDetectionSystemsSpecificChecks
RINF index: 1.1.1.3.7.1.2
RINF index: 1.2.1.1.6.1
used in RCC calculations: true
created: 2020-08-24
modified: 2021-08-08
comment: Reference to the technical specification of train detection system, in accordance with the specification referenced in Appendix A-1, index [D]. The allowed values for this property belong to the SKOS Concept Scheme http://data.europa.eu/949/concepts/train-detection-specific-checks/TrainDetectionSystemsSpecificChecks
term status: stable

Type of train detection system
type: ObjectProperty
domain: Class
  union of: Train Detection System
  union of: Vehicle Type
range: Concept
XML name: CTD_DetectionSystem
ERATV index: 4.14.1
in SKOS Concept Scheme: TrainDetectionSystems
RINF index: 1.1.1.3.7.1.1
RINF index: 1.2.1.1.3.1.1
used in RCC calculations: true
created: 2021-08-07
modified: 2021-08-07
comment: Indication of types of train detection systems installed. The allowed values for this property belong to the SKOS Concept Scheme http://data.europa.eu/949/concepts/train-detection/TrainDetectionSystems
term status: stable

TSI compliance of rules on the use of composite brake blocks
type: ObjectProperty
domain: Train Detection System
range: Concept
XML name: CTD_TSICompositeBrakeBlocks
in SKOS Concept Scheme: TSICompliances
RINF index: 1.1.1.3.7.21
created: 2021-08-08
modified: 2023-03-14
comment: Deprecated according to the ammendment to the Regulation (EU) 2019/777. TSI compliance of rules on the use of composite brake blocks. The allowed values for this property belong to the SKOS Concept Scheme http://data.europa.eu/949/concepts/tsi-compliances/TSICompliances.
deprecated: true
term status: stable

TSI compliance of Ferromagnetic characteristics of wheel material required
type: ObjectProperty
domain: Train Detection System
range: Concept
XML name: CTD_TSIFerroWheelMat
in SKOS Concept Scheme: TSICompliances
RINF index: 1.1.1.3.7.14
created: 2021-08-08
modified: 2023-03-14
comment: Deprecated according to the ammendment to the Regulation (EU) 2019/777.TSI compliance of Ferromagnetic characteristics of wheel material required. The allowed values for this property belong to the SKOS Concept Scheme http://data.europa.eu/949/concepts/tsi-compliances/TSICompliances. The concept scheme is temporarily non-deferenceable.
deprecated: true
term status: stable

TSI compliance of maximum permitted distance between two consecutive axles
type: ObjectProperty
domain: Train Detection System
range: Concept
XML name: CTD_TSIMaxDistConsecutiveAxles
in SKOS Concept Scheme: TSICompliances
RINF index: 1.1.1.3.7.2.1
created: 2021-08-07
modified: 2023-03-14
comment: Deprecated according to the ammendment to the Regulation (EU) 2019/777. Indication whether required distance between two consecutive axles is compliant with the TSI. The allowed values for this property belong to the SKOS Concept Scheme http://data.europa.eu/949/concepts/tsi-compliances/TSICompliances.
deprecated: true
term status: stable

TSI compliance of maximum permitted impedance between opposite wheels of a wheelset
type: ObjectProperty
domain: Train Detection System
range: Concept
XML name: CTD_TSIMaxImpedanceWheelset
in SKOS Concept Scheme: TSICompliances
RINF index: 1.1.1.3.7.15.1
created: 2021-08-08
modified: 2023-03-14
comment: Deprecated according to the ammendment to the Regulation (EU) 2019/777. TSI compliance of maximum permitted impedance between opposite wheels of a wheelset. The allowed values for this property belong to the SKOS Concept Scheme http://data.europa.eu/949/concepts/tsi-compliances/TSICompliances.
deprecated: true
term status: stable

TSI compliance of rules for vehicle metal construction
type: ObjectProperty
domain: Train Detection System
range: Concept
XML name: CTD_TSIMetalConstruction
in SKOS Concept Scheme: TSICompliances
RINF index: 1.1.1.3.7.13
created: 2021-08-08
modified: 2023-03-14
comment: Deprecated according to the ammendment to the Regulation (EU) 2019/777. TSI compliance of rules for vehicle metal construction. The allowed values for this property belong to the SKOS Concept Scheme http://data.europa.eu/949/concepts/tsi-compliances/TSICompliances.
deprecated: true
term status: stable

TSI compliance of rules for metal-free space around wheels
type: ObjectProperty
domain: Train Detection System
range: Concept
XML name: CTD_TSIMetalFree
in SKOS Concept Scheme: TSICompliances
RINF index: 1.1.1.3.7.12
created: 2021-08-08
modified: 2023-03-14
comment: Deprecated according to the ammendment to the Regulation (EU) 2019/777. TSI compliance of rules for metal-free space around wheels. The allowed values for this property belong to the SKOS Concept Scheme http://data.europa.eu/949/concepts/tsi-compliances/TSICompliances.
deprecated: true
term status: stable

TSI compliance of rules on combination of RST characteristics influencing shunting impedance
type: ObjectProperty
domain: Train Detection System
range: Concept
XML name: CTD_TSIRSTShuntImpedance
in SKOS Concept Scheme: TSICompliances
RINF index: 1.1.1.3.7.23
created: 2021-08-08
modified: 2023-03-14
comment: Deprecated according to the ammendment to the Regulation (EU) 2019/777. TSI compliance of rules on combination of RST characteristics influencing shunting impedance. The allowed values for this property belong to the SKOS Concept Scheme http://data.europa.eu/949/concepts/tsi-compliances/TSICompliances.
deprecated: true
term status: stable

TSI Compliance of rules on sand characteristics
type: ObjectProperty
domain: Train Detection System
range: Concept
XML name: CTD_TSISandCharacteristics
in SKOS Concept Scheme: TSICompliances
RINF index: 1.1.1.3.7.19
created: 2021-08-08
modified: 2023-03-14
comment: Deprecated according to the ammendment to the Regulation (EU) 2019/777. TSI Compliance of rules on sand characteristics. The allowed values for this property belong to the SKOS Concept Scheme http://data.europa.eu/949/concepts/tsi-compliances/TSICompliances.
deprecated: true
term status: stable

TSI compliance of sanding
type: ObjectProperty
domain: Train Detection System
range: Concept
in SKOS Concept Scheme: TSICompliances
RINF index: 1.1.1.3.7.16
created: 2021-08-08
modified: 2023-03-14
comment: Deprecated according to the ammendment to the Regulation (EU) 2019/777. TSI compliance of sanding rules to allow compatibility with track circuits. Too much sand brings the risk of not detecting trains in tracks equipped with track circuits. The allowed values for this property belong to the SKOS Concept Scheme http://data.europa.eu/949/concepts/tsi-compliances/TSICompliances.
deprecated: true
term status: unstable

TSI compliance of rules on shunt assisting devices
type: ObjectProperty
domain: Train Detection System
range: Concept
XML name: CTD_TSIShuntDevices
in SKOS Concept Scheme: TSICompliances
RINF index: 1.1.1.3.7.22
created: 2021-08-08
modified: 2023-03-14
comment: Deprecated according to the ammendment to the Regulation (EU) 2019/777. TSI compliance of rules on shunt assisting devices. The allowed values for this property belong to the SKOS Concept Scheme http://data.europa.eu/949/concepts/tsi-compliances/TSICompliances.
deprecated: true
term status: stable

Accepted TSI compliant pantograph heads
type: ObjectProperty
domain: Class
  union of: Subset with common characteristics
  union of: Track
range: Concept
XML name: EPA_TSIHeads
in SKOS Concept Scheme: CompliantPantographHeads
RINF index: 1.1.1.2.3.1
used in RCC calculations: true
created: 2020-08-25
modified: 2021-09-11
comment: Indication of TSI compliant pantograph heads which are allowed to be used. The allowed values for this property belong to the SKOS Concept Scheme http://data.europa.eu/949/concepts/compliant-pantograph-heads/CompliantPantographHeads.
term status: stable

Type version id
type: ObjectProperty
domain: Vehicle Type
range: Concept
in SKOS Concept Scheme: VehicleTypeVersionIds
created: 2022-11-03
comment: Indicates the registrationVersion with Ids 10,20 and 30 indicating registration according to Directive 2008/57/EC and implementing Decision 2011/665/EU, and 40 and 50 indicating registration according to regime described in Directive 2008/57/EC. The allowed values for this property belong to the SKOS Concept Scheme http://data.europa.eu/949/concepts/type-version-ids/TypeVersionIds.
term status: stable

Vehicle keeper
type: ObjectProperty
domain: Vehicle
range: Vehicle Keeper
created: 2020-11-23
modified: 2020-11-23
comment: Indicates the organization that owns/operated a vehicle or wagon.
term status: stable

Vehicle type
type: ObjectProperty
domain: Vehicle
range: Vehicle Type
created: 2020-11-22
modified: 2020-11-22
comment: Indicates the vehicle type of a specific vehicle or wagon.
term status: stable

Vehicle type maximum speed and cant deficiency
type: ObjectProperty
domain: Vehicle Type
range: Maximum speed and cant deficiency
ERATV index: 4.6.4
created: 2023-04-05
comment: Relates the vehicle type with its values of maximum speed and cant deficiency.
term status: stable

Voice GSM-R network
type: ObjectProperty
type: FunctionalProperty
domain: Vehicle Type
range: Concept
ERATV index: 4.13.2.10
in SKOS Concept Scheme: GSMRNetworks
created: 2020-08-31
modified: 2021-08-02
comment: Voice SIM Card GSM-R Home Network. The allowed values for this property belong to the SKOS Concept Scheme http://data.europa.eu/949/concepts/gsmr-networks/GSMRNetworks
term status: stable

Radio system compatibility voice
type: ObjectProperty
domain: Class
  union of: Track
  union of: Vehicle Type
range: Concept
XML name: CRG_RadioCompVoice
ERATV index: 4.13.2.5
in SKOS Concept Scheme: RadioSystemCompatibilitiesVoice
RINF index: 1.1.1.3.3.9
RINF index: 1.2.1.1.2.9
created: 2020-08-31
modified: 2021-09-12
comment: Radio requirements used for demonstrating technical compatibility voice. The allowed values for this property belong to the SKOS Concept Scheme http://data.europa.eu/949/concepts/voice-radio-system-compatibilities/VoiceRadioSystemCompatibilities. This concept scheme is temporatily non-deferenceable.
term status: stable

Nominal track gauge
type: ObjectProperty
type: FunctionalProperty
domain: Class
  union of: Track
  union of: Vehicle Type
range: Concept
XML name: ITP_NomGauge
ERATV index: 4.1.3
in SKOS Concept Scheme: NominalTrackGauges
RINF index: 1.1.1.1.4.1
RINF index: 1.2.1.0.4.1
used in RCC calculations: true
created: 2020-07-29
modified: 2021-09-10
comment: A single value expressed in millimetres that identifies the track and vehicle wheel set gauge. The allowed values for this property belong to the SKOS Concept Scheme http://data.europa.eu/949/concepts/nominal-track-gauges/NominalTrackGauges
term status: stable

Wheelset gauge changeover facility
type: ObjectProperty
type: FunctionalProperty
domain: Vehicle Type
range: Concept
ERATV index: 4.1.11
in SKOS Concept Scheme: GaugeChangeoverFacilities
created: 2020-09-01
modified: 2021-08-25
comment: Wheelset gauge changeover facility. The allowed values for this property belong to the SKOS Concept Scheme http://data.europa.eu/949/concepts/gauge-changeover-facilities/GaugeChangeoverFacilities
term status: stable

hasGeometry
type: ObjectProperty
XML name: OPGeographicLocation
RINF index: 1.1.0.0.1.1
RINF index: 1.1.1.0.1.1
RINF index: 1.1.1.3.14.6
RINF index: 1.2.0.0.0.5
RINF index: 1.2.1.0.8.5
used in RCC calculations: true

ID and phone number of ERTMS/ETCS Radio Block Center
type: DatatypeProperty
domain: Class
  union of: Subset with common characteristics
  union of: Track
range: string
RINF index: 1.1.1.3.2.17
RINF index: 1.2.1.1.1.17
created: 2023-03-14
comment: Unique RBC identification (NID_C+NID_RBC) and calling number (NID_RADIO) as defined in the specification referenced in Appendix A-1, index [C].
term status: stable

Acceleration allowed at level crossing
type: DatatypeProperty
type: FunctionalProperty
domain: Class
  union of: Subset with common characteristics
  union of: Track
range: string
XML name: IHS_AccelerationLevelCrossing
RINF index: 1.1.1.1.7.3
created: 2021-08-03
modified: 2021-09-11
comment: Existence of limit for acceleration of train if stopping or recovering speed close to a level crossing expressed in a specific reference acceleration curve.
term status: stable

Documents available by the IM relating to braking performance
type: DatatypeProperty
domain: Class
  union of: Subset with common characteristics
  union of: Track
range: anyURI
XML name: CBP_BrakePerfDocRef
RINF index: 1.1.1.3.11.3
used in RCC calculations: true
created: 2020-08-24
modified: 2021-09-12
comment: Electronic document available in two EU languages from the IM stored by the Agency providing additional information as defined in point (2) of point 4.2.2.6.2 of OPE TSI.
term status: stable

Alternative name
type: DatatypeProperty
type: FunctionalProperty
domain: Vehicle Type
range: string
ERATV index: 1.2
created: 2020-07-29
modified: 2020-07-29
comment: Alternative name of a vehicle.
term status: stable

Altitude range
type: DatatypeProperty
domain: Vehicle Type
range: string
ERATV index: 4.3.2
created: 2021-08-26
modified: 2021-08-26
comment: Altitude range.
term status: stable

Altitude range detail
type: DatatypeProperty
domain: Vehicle Type
range: integer
ERATV index: 4.3.2.1
created: 2021-08-26
modified: 2021-08-26
comment: Altitude range value for 'X' if value 'AX' is selected in altitude range.
term status: stable

Information of the train access level for which the boarding aid can be used.
type: DatatypeProperty
type: FunctionalProperty
domain: Platform
range: integer
XML name: IPL_AreaBoardingAid
RINF index: 1.2.1.0.6.7
created: 2021-08-02
modified: 2023-01-20
comment: Information of the train access level for which the boarding aid can be used. Data is presented as the vertical difference that is overcome by the platform boarding aid in millimetres. The value “0” means that the platform is not equipped with a platform boarding aid.
term status: stable

Existence of platform assistance for starting train
type: DatatypeProperty
type: FunctionalProperty
domain: Platform
range: boolean
XML name: IPL_AssistanceStartingTrain
RINF index: 1.2.1.0.6.6
created: 2021-08-02
modified: 2021-08-02
comment: Indication of existence of equipment or staff supporting the train crew in starting the train.
term status: stable

ATO error corrections required for the on-board
type: DatatypeProperty
domain: Class
  union of: Subset with common characteristics
  union of: Track
range: anyURI
RINF index: 1.1.1.3.13.4
created: 2023-03-14
comment: List of unacceptable errors impacting the IM network that are required to be solved in the on-board according to the CCS TSI point 7.2.10.3 specification maintenance point.
term status: stable

Automatic dropping device required
type: DatatypeProperty
type: FunctionalProperty
domain: Class
  union of: Subset with common characteristics
  union of: Track
range: boolean
XML name: ERS_AutoDropRequired
RINF index: 1.1.1.2.5.3
used in RCC calculations: true
created: 2020-08-25
modified: 2021-09-12
comment: Indication of whether an automatic dropping device (ADD) required on the vehicle.
term status: stable

Axle spacing
type: DatatypeProperty
type: FunctionalProperty
domain: Vehicle Type
range: string
ERATV index: 4.5.3.4
created: 2020-08-24
modified: 2021-08-26
comment: Position of the axles along the unit. a: Distance between axles; b: Distance from end axle to the end of the nearest coupling plane; c: distance between two inside axles.
term status: stable

Big metal mass
type: DatatypeProperty
domain: Class
  union of: Subset with common characteristics
  union of: Track
range: boolean
RINF index: 1.1.1.3.2.18
RINF index: 1.2.1.1.1.18
created: 2023-03-14
comment: Indication of existence of metal mass in the vicinity of the location, susceptible of perturbating the reading of balises by the on-board system.
term status: stable

Boarding aids
type: DatatypeProperty
domain: Vehicle Type
range: string
ERATV index: 4.12.3.2
created: 2021-08-31
modified: 2021-08-31
comment: Description of any integrated boarding aids (if provided).
term status: stable

Brake weight percentage
type: DatatypeProperty
type: FunctionalProperty
domain: Vehicle Type
range: string
ERATV index: 4.7.6
created: 2020-08-24
modified: 2021-08-26
comment: Brake weight percentage (lambda) or Braked mass.
term status: stable

Is bridge
type: DatatypeProperty
domain: Track
range: boolean
term status: stable
definition: Whether or not a track is associated with a bridge.

Cant defficiency
type: DatatypeProperty
domain: Vehicle Type
range: integer
ERATV index: 4.6.1
created: 2021-08-26
modified: 2021-08-26
comment: Cant deficiency (maximum uncompensated lateral acceleration) for which the vehicle has been assessed. For dual gauge vehicles values for each gauge have to be indicated.
term status: stable

Cant deficiency
type: DatatypeProperty
type: FunctionalProperty
domain: Class
  union of: Subset with common characteristics
  union of: Track
range: int
XML name: ITP_CantDeficiency
RINF index: 1.1.1.1.4.2
used in RCC calculations: true
created: 2020-08-24
modified: 2021-09-10
comment: Maximum cant deficiency expressed in millimetres defined as difference between the applied cant and a higher equilibrium cant the line has been designed for.
term status: stable

Catenary max rated current
type: DatatypeProperty
domain: Vehicle Type
range: double
ERATV index: 4.10.3
created: 2021-08-31
modified: 2021-08-31
comment: Maximum rated current from the catenary (to be indicated for each electrical energy supply system the vehicle is equipped for), given in A.
term status: stable

Document with the procedure(s) for static and dynamic route compatibility checks
type: DatatypeProperty
domain: Class
  union of: Subset with common characteristics
  union of: Track
range: anyURI
XML name: IPP_StructureCheckDocRef
RINF index: 1.1.1.1.2.4.4
used in RCC calculations: true
created: 2023-03-14
modified: 2021-09-10
comment: Electronic document available in two EU languages from the IM stored by the Agency with: - precise procedures for the static and dynamic route compatibility checks; Or - relevant information for carrying out the checks for specific structures.
term status: stable

Compliance of the tunnel with INF TSI
type: DatatypeProperty
type: FunctionalProperty
domain: Tunnel
range: boolean
XML name: ITU_TSITunnel
RINF index: 1.1.1.1.8.8.1
created: 2021-08-03
modified: 2021-08-03
comment: Compliance of the tunnel with INF TSI at the maximum permitted speed.
term status: stable

Composite brake block retrofitted
type: DatatypeProperty
domain: Vehicle
range: boolean
created: 2020-11-23
modified: 2020-11-23
comment: Indicates if a vehicle's composite brake block is retrofitted
term status: stable

Permission for regenerative braking
type: DatatypeProperty
domain: Contact Line System
range: boolean
XML name: ECS_RegenerativeBraking
RINF index: 1.1.1.2.2.4
used in RCC calculations: true
created: 2020-08-24
modified: 2023-01-20
comment: Indication whether regenerative braking is permitted, not permitted, or permitted under specific conditions.
term status: stable

Conditions applying in regards to regenerative braking
type: DatatypeProperty
domain: Contact Line System
range: anyURI
Appendix D2 index: 3.3.7
RINF index: 1.1.1.2.2.4.1
created: 2022-11-10
modified: 2023-03-14
source: oj
comment: Name and/or reference of the document specifying the conditions applying in regards to regenerative braking. In https://eur-lex.europa.eu/eli/reg_impl/2019/773/oj 3.3.7 Conditions applying with regard to regenerative braking.
term status: stable

Permitted conditions for charging electric energy storage for traction purposes at standstill
type: DatatypeProperty
domain: Contact Line System
range: anyURI
RINF index: 1.2.1.0.7.2
created: 2023-03-14
comment: Conditions set by IMs according to a standardised document.
term status: stable

Special technical conditions required to switch over between ERTMS/ETCS and Class B systems
type: DatatypeProperty
domain: Class
  union of: Subset with common characteristics
  union of: Track
range: anyURI
Appendix D2 index: 3.4.3
RINF index: 1.1.1.3.8.3
RINF index: 1.2.1.1.7.3
created: 2022-10-28
modified: 2023-03-14
source: oj
comment: Name and/or reference of the document specifying the Special technical conditions required to switch over between ERTMS/ETCS and Class B systems. In https://eur-lex.europa.eu/eli/reg_impl/2019/773/oj 3.4.3 Special technical conditions required to switch over between ERTMS/ETCS and Class B systems.
term status: stable

Special conditions to switch over between different class B train protection, control and warning systems
type: DatatypeProperty
domain: Class
  union of: Subset with common characteristics
  union of: Track
range: anyURI
Appendix D2 index: 3.4.2
RINF index: 1.1.1.3.8.1.1
RINF index: 1.2.1.1.7.1.1
created: 2022-10-28
source: oj
comment: Conditions to switch over between different class B train protection, control and warning systems. In https://eur-lex.europa.eu/eli/reg_impl/2019/773/oj 3.4.2 Special conditions to switch over between different class B train protection, control and warning systems.
term status: stable

Conditions train formation
type: DatatypeProperty
domain: Vehicle Type
range: string
ERATV index: 4.1.4
created: 2021-08-25
modified: 2021-08-25
comment: Conditions of use regarding train formation.
term status: stable

Contact strip material metallic content
type: DatatypeProperty
domain: Class
  union of: Subset with common characteristics
  union of: Track
range: integer
XML name: EPA_StripMaterial
RINF index: 1.1.1.2.3.4
used in RCC calculations: true
created: 2023-01-25
comment: In case that the value of the property era:contactStripMaterial is "impregnated carbon", it is the metallic content in % (this value must be added). This is the maximum percentage allowed.
term status: stable

Cross section area
type: DatatypeProperty
type: FunctionalProperty
domain: Tunnel
range: integer
XML name: ITU_CrossSectionArea
RINF index: 1.1.1.1.8.8
created: 2021-08-03
modified: 2021-08-03
comment: Smallest cross section area in square metres of the tunnel.
term status: stable

Current or power limitation on board required
type: DatatypeProperty
domain: Contact Line System
range: boolean
XML name: ERS_PowerLimitOnBoard
RINF index: 1.1.1.2.5.1
used in RCC calculations: true
created: 2020-08-25
modified: 2021-09-12
comment: Indication of whether an on board current or power limitation function on vehicles is required.
term status: stable

Currently valid
type: DatatypeProperty
domain: ERA Feature
range: boolean
created: 2022-12-13
comment: Indicates whether a feature, e.g. operational point, is currently valid according to its validity start and end dates.
term status: stable

D_NVOVTRP
type: DatatypeProperty
domain: Class
  union of: Subset with common characteristics
  union of: Track
range: integer
Appendix D3 index: 1.5.5
RINF index: 1.1.1.3.2.16.5
created: 2022-11-07
modified: 2023-03-14
comment: Maximum distance for overriding the train trip in metres According to the specification referenced in Appendix A-1, index [C]. In Subset 26, chapter 7. 7.5.1.15 D_NVOVTRP https://www.era.europa.eu/sites/default/files/filesystem/ertms/ccs_tsi_annex_a_-_mandatory_specifications/set_of_specifications_3_etcs_b3_r2_gsm-r_b1/index004_-_subset-026_v360.zip.
term status: stable

D_NVPOTRP
type: DatatypeProperty
domain: Class
  union of: Subset with common characteristics
  union of: Track
range: integer
Appendix D3 index: 1.5.7
RINF index: 1.1.1.3.2.16.7
RINF index: 1.2.1.1.1.16.7
created: 2022-11-07
modified: 2023-03-14
comment: Maximum distance for reversing in Post Trip mode in metres. According to the specification referenced in Appendix A-1, index [C]. In https://www.era.europa.eu/sites/default/files/filesystem/ertms/ccs_tsi_annex_a_-_mandatory_specifications/set_of_specifications_3_etcs_b3_r2_gsm-r_b1/index004_-_subset-026_v360.zip Subset 26, chapter 7. 7.5.1.16 D_NVPOTRP.
term status: stable

D_NVROLL
type: DatatypeProperty
domain: Class
  union of: Subset with common characteristics
  union of: Track
range: integer
Appendix D3 index: 1.5.1
RINF index: 1.1.1.3.2.16.1
RINF index: 1.2.1.1.1.16.1
created: 2022-11-07
modified: 2023-03-14
comment: Parameter used by the ETCS on-board to supervise the distance allowed to be travelled under the roll-away protection and the reverse movement protection, in metres According to the specification referenced in Appendix A-1, index [C]. In https://www.era.europa.eu/sites/default/files/filesystem/ertms/ccs_tsi_annex_a_-_mandatory_specifications/set_of_specifications_3_etcs_b3_r2_gsm-r_b1/index004_-_subset-026_v360.zip Subset 26, chapter 7. 7.5.1.17 D_NVROLL.
term status: stable

Dangerous goods tank code
type: DatatypeProperty
domain: Vehicle Type
range: string
ERATV index: 4.1.9
created: 2021-08-25
modified: 2021-08-25
comment: Dangerous goods for which the vehicle is suitable (tank code).
term status: stable

EI declaration of demonstration for track (ENE)
type: DatatypeProperty
domain: Class
  union of: Subset with common characteristics
  union of: Track
range: string
XML name: EDE_EIDemonstration
RINF index: 1.1.1.2.1.2
created: 2021-08-08
modified: 2021-09-11
comment: Unique number for EI declarations following the same format requirements as specified for EC declarations in Annex VII of Commission Implementing Regulation (EU) 2019/250.
term status: stable

EI declaration of demonstration for track/siding [INF]
type: DatatypeProperty
domain: Class
  union of: Siding
  union of: Track
range: string
XML name: IDE_EIDemonstration
RINF index: 1.1.1.1.1.2
RINF index: 1.2.1.0.1.2
RINF index: 1.2.2.0.1.2
created: 2021-08-03
modified: 2023-03-14
comment: Unique number for EI declarations following the same format requirements as specified for EC declarations in Annex VII of Commission Implementing Regulation (EU) 2019/250. In https://eur-lex.europa.eu/legal-content/EN/TXT/HTML/?uri=CELEX:32019R0777&from=EN
term status: stable

EI declaration of demonstration for tunnel (SRT)
type: DatatypeProperty
domain: Tunnel
range: string
XML name: ITU_EIDemonstration
RINF index: 1.1.1.1.8.6
RINF index: 1.2.1.0.5.4
RINF index: 1.2.2.0.5.4
created: 2021-08-03
modified: 2021-08-11
comment: Unique number for EI declarations following the same format requirements as specified for EC declarations in Annex VII of Commission Implementing Regulation (EU) 2019/250.
term status: stable

Design mass under exceptional payload
type: DatatypeProperty
type: FunctionalProperty
domain: Vehicle Type
range: integer
ERATV index: 4.5.2.3
created: 2020-08-24
modified: 2020-11-03
comment: Design mass under exceptional payload.
term status: stable

Design mass under normal payload
type: DatatypeProperty
type: FunctionalProperty
domain: Vehicle Type
range: integer
ERATV index: 4.5.2.2
created: 2020-08-24
modified: 2020-11-03
comment: Design mass under normal payload.
term status: stable

Design mass in working order
type: DatatypeProperty
type: FunctionalProperty
domain: Vehicle Type
range: integer
ERATV index: 4.5.2.1
created: 2020-08-24
modified: 2020-11-03
comment: Design mass in working order.
term status: stable

Diesel or other thermal traction allowed
type: DatatypeProperty
type: FunctionalProperty
domain: Tunnel
range: boolean
XML name: ITU_DieselThermAllowed
RINF index: 1.2.1.0.5.9
created: 2021-08-09
modified: 2021-08-09
comment: Indication whether it is allowed to use diesel or other thermal traction in the tunnel.
term status: stable

Digital schematic overview
type: DatatypeProperty
domain: Operational Point
range: wktLiteral
RINF index: 1.2.0.0.0.7.2
created: 2023-03-14
comment: Diagrammatic representation of the operational point in Well Known Text polyline
term status: stable

Distance between signboard and phase separation ending
type: DatatypeProperty
type: FunctionalProperty
domain: Class
  union of: Subset with common characteristics
  union of: Track
range: integer
XML name: EOS_DistSignToPhaseEnd
RINF index: 1.1.1.2.4.3
used in RCC calculations: true
created: 2021-08-08
modified: 2021-09-12
comment: Specific for route compatibility check on French network. Distance between the signboard authorizing the driver to ‘raise pantograph’ or ‘close the circuit breaker’ after passing the phase separation and the end of the phase separation section.
term status: stable

Document with restriction related to the position of Multiple Traction unit(s) to comply with contact line separation
type: DatatypeProperty
domain: Class
  union of: Subset with common characteristics
  union of: Track
range: anyURI
RINF index: 1.1.1.2.5.5
created: 2023-03-14
comment: Name and/or reference of the document specifying the restriction(s) related to the position of Multiple Traction unit(s) to comply with contact line separation.
term status: stable

Document with restriction related to power consumption of specific electric traction unit(s)
type: DatatypeProperty
domain: Class
  union of: Subset with common characteristics
  union of: Track
range: anyURI
RINF index: 1.1.1.2.5.4
created: 2023-03-14
comment: Name and/or reference of the document specifying the restriction(s) related to power consumption of specific electric traction unit(s).
term status: stable

Driving cabs
type: DatatypeProperty
type: FunctionalProperty
domain: Vehicle Type
range: integer
ERATV index: 4.1.1
created: 2021-08-24
modified: 2021-08-24
comment: Number of driving cabs. For wagons the number of driving cabs is to be set to zero (0).
term status: stable

Eddy current brake prevention
type: DatatypeProperty
type: FunctionalProperty
domain: Vehicle Type
range: boolean
ERATV index: 4.7.4.1.2
created: 2020-08-24
modified: 2020-11-03
comment: Possibility of preventing the use of the eddy current track brake (only if fitted with eddy current brake)
term status: stable

Document with the conditions for the use of eddy current brakes
type: DatatypeProperty
domain: Class
  union of: Subset with common characteristics
  union of: Track
range: anyURI
XML name: ILR_ECBDocRef
Appendix D2 index: 3.4.5
RINF index: 1.1.1.1.6.4
used in RCC calculations: true
created: 2020-08-24
modified: 2021-09-10
source: oj
comment: Electronic document available in two EU languages from the IM stored by the Agency with conditions for the use of eddy current brakes identified in 1.1.1.1.6.2. In https://eur-lex.europa.eu/eli/reg_impl/2019/773/oj 3.4.5 Permissibility to use Eddy-current brake.
term status: stable

Eddy current braking fitted
type: DatatypeProperty
type: FunctionalProperty
domain: Vehicle Type
range: boolean
ERATV index: 4.7.4.1.1
created: 2022-09-06
comment: Eddy current track brake fitted. New property defined to distinghish it from eddyCurrentBraking which is a RINF SKOS property.
term status: stable

Emergency braking
type: DatatypeProperty
type: FunctionalProperty
domain: Vehicle Type
range: string
ERATV index: 4.7.5
created: 2020-08-24
modified: 2021-08-26
comment: Stopping distance and deceleration profile for each load condition per design maximum speed.
term status: stable

End intrinsic coordinate
type: DatatypeProperty
domain: Net Element
range: double
created: 2021-04-01
modified: 2021-04-01
comment: Indicates the coordinate point where a linear object ends.
term status: stable

Energy meter installed
type: DatatypeProperty
domain: Vehicle Type
range: boolean
ERATV index: 4.10.12
created: 2021-08-31
modified: 2021-08-31
comment: TSI conform energy meter for billing purposes installed on board.
term status: stable

Energy supply max power
type: DatatypeProperty
domain: Vehicle Type
range: double
ERATV index: 4.10.2
created: 2021-08-31
modified: 2021-08-31
comment: Maximum power (to be indicated for each energy supply system the vehicle is equipped for), given in kW.
term status: stable

Energy supply system TSI compliant
type: DatatypeProperty
domain: Contact Line System
range: boolean
XML name: ECS_TSIVoltFreq
RINF index: 1.1.1.2.2.1.2.1
used in RCC calculations: true
created: 2020-08-24
modified: 2021-08-06
comment: Indication if the traction supply system (nominal voltage and frequency) is fully compliant with TSI.
term status: stable

ETCS data communication application
type: DatatypeProperty
type: FunctionalProperty
domain: Vehicle Type
range: string
ERATV index: 4.13.2.9
created: 2021-08-31
modified: 2021-08-31
comment: Data communication application for ETCS implementation.
term status: stable

ETCS error corrections required for the on-board
type: DatatypeProperty
domain: Class
  union of: Subset with common characteristics
  union of: Track
range: anyURI
RINF index: 1.1.1.3.1.2
created: 2023-03-14
comment: List of unacceptable errors impacting the IM network that are required to be solved in the on-board according to the CCS TSI point 7.2.10.3 specification maintenance point.
term status: stable

ETCS trackside implements level crossing procedure or an equivalent solution
type: DatatypeProperty
domain: Class
  union of: Subset with common characteristics
  union of: Track
range: boolean
Appendix D3 index: 1.2
RINF index: 1.1.1.3.2.13
RINF index: 1.2.1.1.1.13
created: 2022-11-04
comment: If the trackside does not implement any solution to cover defective LXs (which are normally protected by means of a technical system), then drivers will be required to comply with instructions received from other sources.
term status: stable

ETCS infill necessary for line access
type: DatatypeProperty
type: FunctionalProperty
domain: Class
  union of: Subset with common characteristics
  union of: Track
range: boolean
XML name: CPE_Infill
RINF index: 1.1.1.3.2.3
RINF index: 1.2.1.1.1.3
created: 2021-08-08
modified: 2021-09-12
comment: Indication whether infill is required to access the line for safety reasons.
term status: stable

ETCS national applications
type: DatatypeProperty
domain: Vehicle Type
range: string
ERATV index: 4.13.1.4
created: 2021-08-31
modified: 2021-08-31
comment: ETCS national applications implemented (NID_XUSER of Packet 44).
term status: stable

ETCS national packet 44 application implemented
type: DatatypeProperty
type: FunctionalProperty
domain: Class
  union of: Subset with common characteristics
  union of: Track
range: boolean
XML name: CPE_NatApplication
RINF index: 1.1.1.3.2.5
RINF index: 1.2.1.1.1.5
created: 2021-08-08
modified: 2021-09-12
comment: Indication whether data for national packet 44 applications is transmitted between track and train.
term status: stable

ETCS on-board implementation
type: DatatypeProperty
type: FunctionalProperty
domain: Vehicle Type
range: string
ERATV index: 4.13.1.7
created: 2021-08-31
modified: 2021-08-31
comment: ETCS on-board implementation.
term status: stable

ETCS optional functions
type: DatatypeProperty
domain: Class
  union of: Subset with common characteristics
  union of: Track
range: string
RINF index: 1.1.1.3.2.7
created: 2021-08-08
modified: 2023-03-14
comment: Deprecated according to the ammendment to the Regulation (EU) 2019/777. Optional ETCS functions which might improve operation on the line.
deprecated: true
term status: unstable

ETCS system version 2.2 or 3.0 functionalities to be required in the next 5 years
type: DatatypeProperty
sub property of: topDataProperty
domain: Class
  union of: Subset with common characteristics
  union of: Track
range: anyURI
RINF index: 1.1.1.3.2.19
RINF index: 1.2.1.1.1.20
created: 2023-03-14
comment: List of ETCS system version 2.2 or 3.0 functionalities to be required in the next 5 years according to CCS TSI point 6.1.1.2 and Appendix G.
term status: stable

Is the ETCS trackside engineered to transmit Track Conditions
type: DatatypeProperty
domain: Class
  union of: Subset with common characteristics
  union of: Track
range: boolean
Appendix D3 index: 1.1
RINF index: 1.1.1.3.2.12
RINF index: 1.2.1.1.1.12
created: 2022-11-04
modified: 2023-03-14
comment: According to the specification referenced in Appendix A-1, index [C] If the trackside does not provide Track Conditions, the driver will need to be informed about such conditions via alternative methods.
term status: stable

Ferromagnetic wheel material
type: DatatypeProperty
domain: Vehicle Type
range: boolean
ERATV index: 4.14.2.12
created: 2021-09-01
modified: 2021-09-01
comment: Wheel material is ferromagnetic.
term status: stable

Fixed seats
type: DatatypeProperty
domain: Vehicle Type
range: string
ERATV index: 4.12.1.1
created: 2021-08-31
modified: 2021-08-31
comment: Number of fixed seats.
term status: stable

Use of flange lubrication forbidden
type: DatatypeProperty
type: FunctionalProperty
domain: Class
  union of: Subset with common characteristics
  union of: Track
range: boolean
XML name: IHS_FlangeLubeForbidden
RINF index: 1.1.1.1.7.1
created: 2021-08-08
modified: 2021-09-11
comment: Indication whether the use of on-board device for flange lubrication is forbidden
term status: stable

Existence of rules on on-board flange lubrication
type: DatatypeProperty
domain: Train Detection System
range: boolean
XML name: CTD_FlangeLubeRules
RINF index: 1.1.1.3.7.20
created: 2021-08-08
modified: 2023-03-14
comment: Deprecated according to the ammendment to the Regulation (EU) 2019/777. Indication whether rules for activation or deactivation of flange lubrication exist.
deprecated: true
term status: stable

Flange lubrication fitted
type: DatatypeProperty
domain: Vehicle Type
range: boolean
ERATV index: 4.9.3.1
created: 2021-08-31
modified: 2021-08-31
comment: Indicates if the vehicle type is fitted for flange lubrication.
term status: stable

Section with train detection limitation is applicable, only for the French network
type: DatatypeProperty
domain: Section with train detection limitation, only for the French network
range: boolean
XML name: CTD_TCLimitation
RINF index: 1.1.1.3.7.1.4
used in RCC calculations: true
created: 2023-04-05
comment: Part of the section with train detection limitation that indicates if it is applicable. Only for the French network.
term status: stable

Railway location of particular points requiring specific checks
type: DatatypeProperty
domain: Class
  union of: Subset with common characteristics
  union of: Track
range: string
XML name: ILL_GaugeCheckLoc
RINF index: 1.1.1.1.3.1.2
RINF index: 1.2.1.0.3.5
used in RCC calculations: true
created: 2020-07-29
modified: 2023-03-14
comment: Location of particular points requiring specific checks due to deviations from gauging referred to in 1.1.1.1.3.1.1.
term status: stable

Document with the transversal section of the particular points requiring specific checks
type: DatatypeProperty
domain: Class
  union of: Subset with common characteristics
  union of: Track
range: anyURI
XML name: ILL_GaugeCheckDocRef
RINF index: 1.1.1.1.3.1.3
RINF index: 1.2.1.0.3.6
used in RCC calculations: true
created: 2020-08-24
modified: 2023-03-14
comment: Electronic document available from the IM stored by the Agency with the transversal section of the particular points requiring specific checks due to deviations from gauging referred to in 1.1.1.1.3.1.1. Where relevant, guidance for the check with the particular point may be attached to the document with the transversal section.
term status: stable

GPRS for ETCS
type: DatatypeProperty
type: FunctionalProperty
domain: Class
  union of: Subset with common characteristics
  union of: Track
range: boolean
XML name: CRG_GPRSForETCS
RINF index: 1.1.1.3.3.3.2
RINF index: 1.2.1.1.2.3.2
created: 2021-08-08
modified: 2021-09-12
comment: Indication if GPRS can be used for ETCS.
term status: stable

Area of implementation of GPRS
type: DatatypeProperty
domain: Class
  union of: Subset with common characteristics
  union of: Track
range: string
XML name: CRG_GPRSAreaOfImpl
RINF index: 1.1.1.3.3.3.3
RINF index: 1.2.1.1.2.3.3
created: 2021-08-09
modified: 2021-09-12
comment: Indication of the area in which GPRS can be used for ETCS.
term status: stable

Gradient for stabling tracks
type: DatatypeProperty
type: FunctionalProperty
domain: Siding
range: double
XML name: ILL_Gradient
RINF index: 1.2.2.0.3.1
used in RCC calculations: true
created: 2021-08-10
modified: 2021-08-10
source: EA166.html
comment: Maximum value of the gradient for stabling tracks expressed in millimetres per metre.
term status: stable

Gradient profile
type: DatatypeProperty
domain: Class
  union of: Subset with common characteristics
  union of: Track
range: string
XML name: ILL_GradProfile
Appendix D2 index: 3.2.1
Appendix D2 index: 3.2.2
RINF index: 1.1.1.1.3.6
used in RCC calculations: true
created: 2020-08-24
modified: 2021-09-10
source: EA166.html
comment: Sequence of gradient values and locations of change in gradient. In https://eur-lex.europa.eu/eli/reg_impl/2019/773/oj 3.2.1 Gradient percentage, 3.2.2 Gradient location.
term status: stable

Additional information on network characteristics
type: DatatypeProperty
domain: Class
  union of: Subset with common characteristics
  union of: Track
range: string
XML name: CRG_AdditionalnetworkInfo
RINF index: 1.1.1.3.3.3.1
RINF index: 1.2.1.1.2.3.1
created: 2021-08-08
modified: 2021-09-12
comment: Any additional information on network characteristics or corresponding document available from the IM and stored by the Agency, e.g.; interference level, leading to the recommendation of additional on-board protection.
term status: stable

No GSM-R coverage
type: DatatypeProperty
type: FunctionalProperty
domain: Class
  union of: Subset with common characteristics
  union of: Track
range: boolean
XML name: CRG_GSMRNoCoverage
RINF index: 1.1.1.3.3.8
RINF index: 1.2.1.1.2.8
created: 2021-08-09
modified: 2021-09-12
comment: Indication if there is no GSMR coverage.
term status: stable

GSM-R sets in driving cab
type: DatatypeProperty
domain: Vehicle Type
range: integer
ERATV index: 4.13.2.2
created: 2021-08-31
modified: 2021-08-31
comment: Number of GSM-R mobile sets in driving cab for data transmission.
term status: stable

GSM-R error corrections required for the on-board
type: DatatypeProperty
domain: Class
  union of: Subset with common characteristics
  union of: Track
range: anyURI
RINF index: 1.1.1.3.3.11
created: 2023-03-14
comment: List of unacceptable errors impacting the IM network that are required to be solved in the on-board according to the CCS TSI point 7.2.10.3 specification maintenance point.
term status: stable

GSM-R network is configured to allow forced de-registration of a functional number by another driver
type: DatatypeProperty
domain: Class
  union of: Subset with common characteristics
  union of: Track
range: boolean
Appendix D3 index: 2.1
RINF index: 1.1.1.3.3.11
RINF index: 1.2.1.1.2.11
created: 2022-11-07
modified: 2023-03-14
comment: This feature will condition the applicable operational rules for drivers and signallers when dealing with cab radios registered under wrong numbers.
term status: stable

Availability by the IM of additional information
type: DatatypeProperty
type: FunctionalProperty
domain: Class
  union of: Subset with common characteristics
  union of: Track
range: boolean
XML name: CBP_AddInfoAvailable
RINF index: 1.1.1.3.11.2
used in RCC calculations: true
created: 2020-08-24
modified: 2021-09-12
comment: Availability by the IM of additional information as defined in point (2) of point 4.2.2.6.2 of OPE TSI.
term status: stable

Has automatic dropping device
type: DatatypeProperty
type: FunctionalProperty
domain: Vehicle Type
range: boolean
ERATV index: 4.10.11
created: 2020-08-25
modified: 2020-11-03
comment: Automatic dropping device (ADD) fitted (to be indicated for each energy supply system the vehicle is equipped for).
term status: stable

Existence of ballast
type: DatatypeProperty
type: FunctionalProperty
domain: Class
  union of: Subset with common characteristics
  union of: Track
range: boolean
XML name: ITP_Ballast
RINF index: 1.1.1.1.4.4
created: 2021-08-03
modified: 2021-09-10
comment: Specifies whether track construction is with sleepers embedded in ballast or not.
term status: stable

Has cant defficiency compensation
type: DatatypeProperty
domain: Vehicle Type
range: boolean
ERATV index: 4.6.2
created: 2021-08-26
modified: 2021-08-26
comment: Vehicle equipped with a cant deficiency compensation system (tilting vehicle).
term status: stable

Has current limitation
type: DatatypeProperty
type: FunctionalProperty
domain: Vehicle Type
range: boolean
ERATV index: 4.10.14
created: 2020-08-24
modified: 2020-11-03
comment: Electric units equipped with power or current limitation function.
term status: stable

Existence of operating restrictions or conditions
type: DatatypeProperty
type: FunctionalProperty
domain: Class
  union of: Subset with common characteristics
  union of: Track
range: boolean
XML name: CPE_RestrictionsConditions
RINF index: 1.1.1.3.2.6
RINF index: 1.2.1.1.1.6
created: 2021-08-08
modified: 2021-09-12
comment: Indication whether restrictions or conditions due to partial compliance with the CCS TSI – Commission Regulation (EU) 2016/919 (5) exist.
term status: stable

Existence of electric shore supply
type: DatatypeProperty
type: FunctionalProperty
domain: Siding
range: boolean
XML name: ITS_ElectricShoreSupply
RINF index: 1.2.2.0.4.6
created: 2021-08-10
modified: 2021-08-10
comment: Indication whether an installation for electric shore supply exists (fixed installation for servicing trains).
term status: stable

Existence of emergency plan
type: DatatypeProperty
type: FunctionalProperty
domain: Tunnel
range: boolean
XML name: ITU_EmergencyPlan
RINF index: 1.1.1.1.8.9
RINF index: 1.2.1.0.5.6
RINF index: 1.2.2.0.5.6
created: 2021-08-03
modified: 2021-08-10
comment: Indication whether emergency plan exists.
term status: stable

Existence of evacuation and rescue points
type: DatatypeProperty
domain: Tunnel
range: boolean
Appendix D2 index: 3.2.3
RINF index: 1.1.1.1.8.13
RINF index: 1.2.1.0.5.11
RINF index: 1.2.2.0.5.10
created: 2022-10-27
modified: 2023-03-14
source: oj
comment: Indication of existence of evacuation and rescue points. In https://eur-lex.europa.eu/eli/reg_impl/2019/773/oj 3.2.3 Tunnels: location, name, length, specific information such as the existence of walkways and points of safe egress as well as the location of safe areas where evacuation of passengers may take place; fire safety categorisation.
term status: stable

Existence of external cleaning facilities
type: DatatypeProperty
type: FunctionalProperty
domain: Siding
range: boolean
XML name: ITS_ExternalCleaning
RINF index: 1.2.2.0.4.2
created: 2021-08-10
modified: 2021-08-10
comment: Indication whether exists an installation for external cleaning facility (fixed installation for servicing trains) as defined in INF TSIs.
term status: stable

Existence of trackside hot axle box detector (HABD)
type: DatatypeProperty
type: FunctionalProperty
domain: Class
  union of: Subset with common characteristics
  union of: Track
range: boolean
XML name: IHS_HABDExist
RINF index: 1.1.1.1.7.4
used in RCC calculations: true
created: 2020-08-24
modified: 2021-09-11
comment: Existence of trackside hot axle box detector (HABD).
term status: stable

Existence of level crossings
type: DatatypeProperty
type: FunctionalProperty
domain: Class
  union of: Subset with common characteristics
  union of: Track
range: boolean
XML name: IHS_LevelCrossing
RINF index: 1.1.1.1.7.2
created: 2021-08-03
modified: 2021-09-11
comment: Indication whether level crossings (including pedestrian track crossing) exist on the section of line.
term status: stable

Has lubrication device prevention
type: DatatypeProperty
domain: Vehicle Type
range: boolean
ERATV index: 4.9.3.2
created: 2021-08-31
modified: 2021-08-31
comment: Possibility of preventing the use of the lubrication device (only if fitted with flange lubrication).
term status: stable

Existence of other train protection, control and warning systems installed
type: DatatypeProperty
type: FunctionalProperty
domain: Class
  union of: Subset with common characteristics
  union of: Track
range: boolean
RINF index: 1.1.1.3.5.1
created: 2021-08-09
modified: 2023-03-14
comment: Deprecated according to the ammendment to the Regulation (EU) 2019/777. Indication if other train protection, control and warning systems in normal operation are installed lineside.
deprecated: true
term status: unstable

Has parking brake
type: DatatypeProperty
type: FunctionalProperty
domain: Vehicle Type
range: boolean
ERATV index: 4.7.3.4
created: 2021-08-26
modified: 2021-08-26
comment: Indicates if a vehicle type has parking brake.
term status: stable

Existence of platform curvature
type: DatatypeProperty
domain: Platform
range: boolean
Appendix D2 index: 2.3.8
RINF index: 1.2.1.0.6.8
created: 2022-10-27
modified: 2023-03-14
source: oj
comment: Indication of the existence of the curvature of the platform. In https://eur-lex.europa.eu/eli/reg_impl/2019/773/oj 2.3.8 Curvature of platforms.
term status: stable

Existence of refuelling
type: DatatypeProperty
type: FunctionalProperty
domain: Siding
range: boolean
XML name: ITS_Refuelling
RINF index: 1.2.2.0.4.4
created: 2021-08-10
modified: 2021-08-10
comment: Indication whether exists an installation for refuelling (fixed installation for servicing trains) as defined in INF TSIs.
term status: stable

Permission for regenerative braking
type: DatatypeProperty
type: FunctionalProperty
domain: Vehicle Type
range: boolean
ERATV index: 4.7.4.3.1
created: 2020-08-24
modified: 2021-08-06
comment: Indication whether regenerative braking is permitted or not.
term status: stable

Existence of sand restocking
type: DatatypeProperty
type: FunctionalProperty
domain: Siding
range: boolean
XML name: ITS_SandRestocking
RINF index: 1.2.2.0.4.5
created: 2021-08-10
modified: 2021-08-10
comment: Indication whether an installation for sand restocking exists (fixed installation for servicing trains).
term status: stable

Has sanding prevention
type: DatatypeProperty
domain: Vehicle Type
range: boolean
ERATV index: 4.14.2.12
created: 2021-09-01
modified: 2021-09-01
comment: Possibility of preventing the use of sanding.
term status: stable

Has schematic overview in digital form
type: DatatypeProperty
domain: Operational Point
range: boolean
RINF index: 1.2.0.0.0.7
created: 2023-03-14
comment: The existence of a schematic overview of the operational point in digital form
term status: stable

Existence of severe climatic conditions
type: DatatypeProperty
type: FunctionalProperty
domain: Class
  union of: Subset with common characteristics
  union of: Track
range: boolean
XML name: IPP_SevereClimateCon
RINF index: 1.1.1.1.2.8
used in RCC calculations: true
created: 2020-08-24
modified: 2021-09-10
comment: Climatic conditions on the line are severe according to European standard.
term status: stable

Has shunting restrictions
type: DatatypeProperty
type: FunctionalProperty
domain: Vehicle Type
range: boolean
ERATV index: 4.8.3
created: 2021-08-31
modified: 2021-08-31
comment: Indicates the presence of shunting restrictions.
term status: stable

System separation
type: DatatypeProperty
type: FunctionalProperty
domain: Class
  union of: Subset with common characteristics
  union of: Track
range: boolean
XML name: EOS_System
RINF index: 1.1.1.2.4.2.1
created: 2021-08-08
modified: 2021-09-12
comment: Indication of existence of system separation.
term status: stable

Existence of train detection system fully compliant with the TSI
type: DatatypeProperty
domain: Class
  union of: Subset with common characteristics
  union of: Track
range: boolean
XML name: CCD_TSITrainDetection
RINF index: 1.1.1.3.4.1
RINF index: 1.2.1.1.3.1
created: 2021-08-09
modified: 2021-09-12
comment: Indication if there is any train detection system installed and fully compliant with the CCS TSI.
term status: stable

Existence of toilet discharge
type: DatatypeProperty
type: FunctionalProperty
domain: Siding
range: boolean
XML name: ITS_ToiletDischarge
RINF index: 1.2.2.0.4.1
created: 2021-08-10
modified: 2021-08-10
comment: Indication whether exists an installation for toilet discharge (fixed installation for servicing trains) as defined in INF TSIs.
term status: stable

Has train integrity confirmation
type: DatatypeProperty
type: FunctionalProperty
domain: Vehicle Type
range: boolean
ERATV index: 4.13.1.9
created: 2020-08-31
modified: 2021-09-12
comment: Indication of on-board management system about completeness of the train information.
term status: stable

Existence of walkways
type: DatatypeProperty
domain: Tunnel
range: boolean
Appendix D2 index: 3.2.3
RINF index: 1.1.1.1.8.12
RINF index: 1.2.1.0.5.10
RINF index: 1.2.2.0.5.9
created: 2022-10-27
modified: 2023-03-14
source: oj
comment: Indication of existence of walkways. In https://eur-lex.europa.eu/eli/reg_impl/2019/773/oj 3.2.3 Tunnels: location, name, length, specific information such as the existence of walkways and points of safe egress as well as the location of safe areas where evacuation of passengers may take place; fire safety categorisation
term status: stable

Existence of water restocking
type: DatatypeProperty
type: FunctionalProperty
domain: Siding
range: boolean
XML name: ITS_WaterRestocking
RINF index: 1.2.2.0.4.3
created: 2021-08-10
modified: 2021-08-10
comment: Indication whether exists an installation for water restocking (fixed installation for servicing trains) as defined in INF TSIs.
term status: stable

Has wheel slide protection system
type: DatatypeProperty
type: FunctionalProperty
domain: Vehicle Type
range: boolean
ERATV index: 4.7.8
created: 2021-08-31
modified: 2021-08-31
comment: Indicates the presence of a wheel slide protection system.
term status: stable

Compliance of structures with the High Speed Load Model (HSLM) dynamic load model
type: DatatypeProperty
type: FunctionalProperty
domain: Class
  union of: Subset with common characteristics
  union of: Track
range: boolean
XML name: IPP_HSLMCompliant
RINF index: 1.1.1.1.2.4.2
used in RCC calculations: true
created: 2020-08-24
modified: 2023-03-14
comment: For sections of line with a maximum permitted speed of 200 km/h or more. Information regarding the procedure to be used to perform the dynamic compatibility check.
term status: stable

Generation of trackside HABD
type: DatatypeProperty
type: FunctionalProperty
domain: Class
  union of: Subset with common characteristics
  union of: Track
range: string
XML name: IHS_HABDGen
RINF index: 1.1.1.1.7.7
used in RCC calculations: true
created: 2020-08-24
modified: 2021-09-11
comment: Specific for the French Italian and Swedish networks. Generation of trackside hot axle box detector.
term status: stable

Identification of trackside HABD
type: DatatypeProperty
type: FunctionalProperty
domain: Class
  union of: Subset with common characteristics
  union of: Track
range: string
XML name: IHS_HABDID
RINF index: 1.1.1.1.7.6
used in RCC calculations: true
created: 2020-08-24
modified: 2021-09-11
comment: ISpecific for the French, Italian and Swedish networks. Applicable if trackside HABD is not TSI compliant, identification of trackside hot axle box detector.
term status: stable

Railway location of trackside HABD
type: DatatypeProperty
domain: Class
  union of: Subset with common characteristics
  union of: Track
range: double
XML name: IHS_HABDLoc
RINF index: 1.1.1.1.7.8
used in RCC calculations: true
created: 2020-08-24
modified: 2021-09-11
comment: Specific for the French Italian and Swedish networks. Applicable if trackside HABD is not TSI compliant, localisation of trackside hot axle box detector.
term status: stable

Trackside HABD TSI compliant
type: DatatypeProperty
type: FunctionalProperty
domain: Class
  union of: Subset with common characteristics
  union of: Track
range: boolean
XML name: IHS_TSIHABD
RINF index: 1.1.1.1.7.5
used in RCC calculations: true
created: 2020-08-24
modified: 2021-09-11
comment: Specific for the French, Italian and Swedish networks. Trackside hot axle box detector TSI compliant.
term status: stable

IM's code
type: DatatypeProperty
sub property of: identifier
type: FunctionalProperty
domain: Infrastructure manager
range: string
XML name: OPSidingIMCode
XML name: OPSidingTunnelIMCode
XML name: OPTrackIMCode
XML name: OPTrackPlatformIMCode
XML name: OPTrackTunnelIMCode
XML name: SOLIMCode
XML name: SOLTunnelIMCode
Appendix D2 index: 1.1
RINF index: 1.1.0.0.0.1
RINF index: 1.1.1.1.8.1
RINF index: 1.2.1.0.0.1
RINF index: 1.2.1.0.5.1
RINF index: 1.2.1.0.6.1
RINF index: 1.2.2.0.0.1
RINF index: 1.2.2.0.5.1
created: 2021-08-02
modified: 2023-03-14
source: oj
comment: Infrastructure manager means anybody or undertaking that is responsible in particular for establishing and maintaining railway infrastructure or a part thereof. In https://eur-lex.europa.eu/eli/reg_impl/2019/773/oj 1.1 infrastructure manager's Name.
term status: stable

Special instructions to switch over between different radio systems
type: DatatypeProperty
domain: Class
  union of: Subset with common characteristics
  union of: Track
range: anyURI
Appendix D2 index: 3.4.4
RINF index: 1.1.1.3.8.2.1
RINF index: 1.2.1.1.7.2.1
created: 2022-10-28
modified: 2023-03-14
source: oj
comment: Name and/or reference of the document specifying the Special instructions to switch over between different radio systems. In https://eur-lex.europa.eu/eli/reg_impl/2019/773/oj 3.4.4 Special instructions (location) to switch over between different radio systems.
term status: stable

Belonging to a quieter route
type: DatatypeProperty
type: FunctionalProperty
domain: Class
  union of: Subset with common characteristics
  union of: Track
range: boolean
XML name: IHS_QuietRoute
RINF index: 1.1.1.1.7.11
created: 2020-11-04
modified: 2021-09-12
comment: Belonging to a ‘quieter route’ in accordance with Article 5b of NOI TSI.
term status: stable

Kilometer
type: DatatypeProperty
domain: Railway location
range: double
XML name: OPRailwayLocation
Appendix D2 index: 2.2.2
RINF index: 1.1.1.1.8.12.1
RINF index: 1.1.1.1.8.13.1
RINF index: 1.1.1.3.14.3
RINF index: 1.2.0.0.0.6
RINF index: 1.2.1.0.5.10.1
RINF index: 1.2.1.0.5.11.1
RINF index: 1.2.1.0.8.3
RINF index: 1.2.2.0.5.10.1
RINF index: 1.2.2.0.5.9.1
created: 2021-01-29
modified: 2021-01-29
source: oj
comment: Distance measured in kilometers from the origin of a national railway line. In https://eur-lex.europa.eu/eli/reg_impl/2019/773/oj 2.2.2 Principal locations (stations, yards, junctions, freight terminals) and their position relative to the line.
term status: stable

Length
type: DatatypeProperty
type: FunctionalProperty
domain: ERA Feature
range: double
XML name: IPL_Length
XML name: IPP_Length
XML name: ITU_Length
XML name: SOLLength
Appendix D2 index: 2.3.6
ERATV index: 4.8.1
RINF index: 1.1.0.0.0.5
RINF index: 1.1.1.1.8.12.1
RINF index: 1.1.1.1.8.13.1
RINF index: 1.1.1.1.8.7
RINF index: 1.1.1.3.14.5
RINF index: 1.2.1.0.5.10.1
RINF index: 1.2.1.0.5.11.1
RINF index: 1.2.1.0.5.5
RINF index: 1.2.1.0.6.4
RINF index: 1.2.2.0.2.1
RINF index: 1.2.2.0.5.10.1
RINF index: 1.2.2.0.5.5
RINF index: 1.2.2.0.5.9.1
used in RCC calculations: true
created: 2021-04-01
modified: 2021-08-11
source: oj
comment: Length of a physical object, which can be a section of line, a tunnel, a platform, etc. Length of section of line (1.1.0.0.0.5), length between operational points at start and end of section of line. In https://eur-lex.europa.eu/eli/reg_impl/2019/773/oj 2.3.6 Length of platforms.
term status: stable

Letter marking
type: DatatypeProperty
domain: Vehicle Type
range: string
ERATV index: 4.1.7
created: 2021-08-25
modified: 2021-08-25
comment: letter marking
term status: stable

Linear coordinate
type: DatatypeProperty
range: double
created: 2021-04-01
modified: 2021-04-01
comment: Indicates the position of an object within a linear positioning system. For example, relative to a national railway line.
term status: stable

Lineside distance indication frequency
type: DatatypeProperty
domain: Class
  union of: Subset with common characteristics
  union of: Track
range: integer
Appendix D2 index: 3.1.3
RINF index: 1.1.1.0.0.3
created: 2022-10-27
modified: 2023-03-14
source: oj
comment: Frequency of track lineside distance indications. In https://eur-lex.europa.eu/eli/reg_impl/2019/773/oj 3.1.3 Lineside indications of distance (frequency, appearance and positioning).
term status: stable

Load capability speed
type: DatatypeProperty
domain: Load capability
range: integer
XML name: IPP_LoadCap
RINF index: 1.1.1.1.2.4
used in RCC calculations: true
created: 2023-01-20
comment: Part of the load capability of a track that corresponds to the speed of the load model. The load capability is a value selected from the list of load models representing: line category which is amended by value of speed [km/h] permitted for a specific load model. The list of values may also be Route Availability which is amended by value of speed [miles/h] permitted for a specific load model.
term status: stable

Loading platform height
type: DatatypeProperty
domain: Vehicle Type
range: integer
ERATV index: 4.8.7
created: 2021-08-31
modified: 2021-08-31
comment: Height of loading platform (for flat wagons and combined transport), given in mm.
term status: stable

Existence of rules and restrictions of a strictly local nature.
type: DatatypeProperty
domain: Class
  union of: Operational Point
  union of: Track
range: boolean
XML name: RUL_LocalRulesOrRestrictions
RINF index: 1.1.1.4.1
RINF index: 1.2.3.1
created: 2021-08-09
modified: 2021-09-12
comment: Existence of rules and restrictions of a strictly local nature.
term status: stable

Documents regarding the rules or restrictions of a strictly local nature available by the IM
type: DatatypeProperty
domain: Class
  union of: Operational Point
  union of: Track
range: anyURI
XML name: RUL_LocalRulesOrRestrictionsDocRef
RINF index: 1.1.1.4.2
RINF index: 1.2.3.2
created: 2021-08-09
modified: 2023-01-20
comment: Electronic document available from the IM stored by the Agency providing additional information.
term status: stable

M_NVDERUN
type: DatatypeProperty
domain: Class
  union of: Subset with common characteristics
  union of: Track
range: boolean
Appendix D3 index: 1.5.10
RINF index: 1.1.1.3.2.16.10
RINF index: 1.2.1.1.1.16.10
created: 2022-11-07
modified: 2023-03-14
comment: Entry of Driver ID permitted while running. According to the specification referenced in Appendix A-1, index [C]. In https://www.era.europa.eu/sites/default/files/filesystem/ertms/ccs_tsi_annex_a_-_mandatory_specifications/set_of_specifications_3_etcs_b3_r2_gsm-r_b1/index004_-_subset-026_v360.zip Subset 26, chapter 7. 7.5.1.75 M_NVDERUN.
term status: stable

Magnetic brake prevention
type: DatatypeProperty
type: FunctionalProperty
domain: Vehicle Type
range: boolean
ERATV index: 4.7.4.2.2
created: 2020-08-24
modified: 2021-04-13
comment: Possibility of preventing the use of the magnetic track brake (only if fitted with magnetic brake)
term status: stable

Document with the conditions for the use of magnetic brakes
type: DatatypeProperty
domain: Class
  union of: Subset with common characteristics
  union of: Track
range: anyURI
XML name: ILR_MBDocRef
Appendix D2 index: 3.4.6
RINF index: 1.1.1.1.6.5
used in RCC calculations: true
created: 2020-08-24
modified: 2021-09-11
source: oj
comment: Electronic document available in two EU languages from the IM stored by the Agency with conditions for the use of magnetic brakes identified in 1.1.1.1.6.3. In https://eur-lex.europa.eu/eli/reg_impl/2019/773/oj 3.4.6 Permissibility to use magnetic brake.
term status: stable

Magnetic braking fitted
type: DatatypeProperty
domain: Vehicle Type
range: boolean
ERATV index: 4.7.4.2.1
created: 2022-09-12
comment: Magnetic track brake fitted. New property defined to distinguish it from magneticBraking which is a RINF SKOS property.
term status: stable

Mass per wheel
type: DatatypeProperty
type: FunctionalProperty
domain: Vehicle Type
range: integer
ERATV index: 4.5.6
created: 2021-08-26
modified: 2021-08-26
comment: Mass per wheel, given in kg.
term status: stable

Maximum current at standstill per pantograph
type: DatatypeProperty
type: FunctionalProperty
domain: Class
  union of: Contact Line System
  union of: Siding
  union of: Vehicle Type
range: double
XML name: ECS_MaxStandstillCurrent
Appendix D2 index: 3.3.8
ERATV index: 4.10.4
RINF index: 1.1.1.2.2.3
RINF index: 1.2.2.0.6.1
used in RCC calculations: true
created: 2020-08-25
modified: 2021-09-12
source: oj
comment: Indication of the maximum allowable train current at standstill expressed in amperes. In https://eur-lex.europa.eu/eli/reg_impl/2019/773/oj 3.3.8 Maximum current at standstill per pantograph.
term status: stable

Maximum permitted distance between two consecutive axles in case of TSI non-compliance
type: DatatypeProperty
domain: Class
  union of: Train Detection System
  union of: Vehicle Type
range: integer
XML name: CTD_MaxDistConsecutiveAxles
ERATV index: 4.14.2.1
RINF index: 1.1.1.3.7.2.2
created: 2021-08-08
modified: 2023-03-14
comment: Deprecated according to the ammendment to the Regulation (EU) 2019/777. However, the parameter remains as it is also an ERATV parameter. Indication of maximum permitted distance between two consecutive axles in case of TSI non-compliance, given in millimetres.
term status: stable

Maximum distance between end of train and first axle
type: DatatypeProperty
domain: Train Detection System
range: integer
XML name: CTD_MaxDistEndTrainFirstAxle
RINF index: 1.1.1.3.7.5
created: 2021-08-08
modified: 2023-03-14
comment: Deprecated according to the ammendment to the Regulation (EU) 2019/777. Indication of maximum distance between end of train and first axle, given in millimetres, applicable for both sides (front and rear) of a vehicle or train.
deprecated: true
term status: stable

Maximum permitted height of the flange
type: DatatypeProperty
domain: Class
  union of: Train Detection System
  union of: Vehicle Type
range: double
XML name: CTD_MaxFlangeHeight
ERATV index: 4.14.2.9
RINF index: 1.1.1.3.7.10
created: 2021-08-08
modified: 2023-03-14
comment: Deprecated according to the ammendment to the Regulation (EU) 2019/777. However, the parameter remains as it is also an ERATV parameter. Maximum permitted flange height, given in millimiters.
term status: stable

Maximum permitted impedance between opposite wheels of a wheelset when not TSI compliant
type: DatatypeProperty
domain: Class
  union of: Train Detection System
  union of: Vehicle Type
range: double
XML name: CTD_MaxImpedanceWheelset
ERATV index: 4.14.2.16
RINF index: 1.1.1.3.7.15.2
created: 2021-08-08
modified: 2023-03-14
comment: Deprecated according to the ammendment to the Regulation (EU) 2019/777. The value of maximum permitted impedance given in ohm in case of TSI non-compliance.
term status: stable

Maximum length vehicle nose
type: DatatypeProperty
domain: Vehicle Type
range: integer
ERATV index: 4.14.2.4
created: 2021-09-01
modified: 2021-09-01
comment: Maximum length of the vehicle nose.
term status: stable

Maximum train current
type: DatatypeProperty
domain: Contact Line System
range: integer
XML name: ECS_MaxTrainCurrent
Appendix D2 index: 3.3.2
RINF index: 1.1.1.2.2.2
created: 2021-08-06
modified: 2021-08-06
source: https://wiki2.railml.org/wiki/IS:maxTrainCurrent_electrification
comment: Indication of the maximum allowable train current expressed in amperes. In https://eur-lex.europa.eu/eli/reg_impl/2019/773/oj 3.3.2 Maximum train current.
term status: stable

Maximum altitude
type: DatatypeProperty
type: FunctionalProperty
domain: Class
  union of: Subset with common characteristics
  union of: Track
range: double
RINF index: 1.1.1.1.2.7
created: 2021-08-03
modified: 2022-10-20
comment: HighFest point of the section of line above sea level in reference to Normal Amsterdam's Peil (NAP).
term status: stable

Maximum average deceleration
type: DatatypeProperty
type: FunctionalProperty
domain: Vehicle Type
range: double
ERATV index: 4.7.1
created: 2021-08-26
modified: 2021-08-26
comment: Maximum train deceleration given in m/s².
term status: stable

Maximum brake thermal energy capacity
type: DatatypeProperty
type: FunctionalProperty
domain: Vehicle Type
range: integer
ERATV index: 4.7.2.1.6
created: 2021-08-26
modified: 2021-08-26
comment: Maximum brake thermal energy capacity given in kJ
term status: stable

Maximum braking distance requested
type: DatatypeProperty
type: FunctionalProperty
domain: Class
  union of: Subset with common characteristics
  union of: Track
range: integer
XML name: CBP_MaxBrakeDist
RINF index: 1.1.1.3.11.1
used in RCC calculations: true
created: 2020-08-24
modified: 2021-09-12
comment: The maximum value of the braking distance [in meters] of a train shall be given for the maximum line speed.
term status: stable

Maximum contact wire height
type: DatatypeProperty
type: FunctionalProperty
domain: Class
  union of: Subset with common characteristics
  union of: Track
  union of: Vehicle Type
range: double
XML name: ECS_MaxWireHeight
ERATV index: 4.10.5
RINF index: 1.1.1.2.2.5
used in RCC calculations: true
created: 2020-08-25
modified: 2021-09-11
comment: Indication of the maximum contact wire height expressed in metres.
term status: stable

Maximum design speed
type: DatatypeProperty
type: FunctionalProperty
domain: Vehicle Type
range: integer
ERATV index: 4.1.2.1
created: 2020-08-24
modified: 2020-11-03
comment: Maximum design speed.
term status: stable

Maximum interference current
type: DatatypeProperty
domain: Train Detection System
range: integer
RINF index: 1.1.1.3.4.2.1
RINF index: 1.2.1.1.3.2.1
created: 2023-03-14
comment: Maximum interference current limits allowed for track circuits for a defined frequency band.
term status: stable

Maximum locomotives coupled
type: DatatypeProperty
type: FunctionalProperty
domain: Vehicle Type
range: integer
ERATV index: 4.1.5
created: 2021-08-25
modified: 2021-08-25
comment: Maximum number of trainsets or locomotives coupled together in multiple operation.
term status: stable

Maximum magnetic field direction X
type: DatatypeProperty
domain: Maximum magnetic field
range: integer
RINF index: 1.1.1.3.4.2.3
RINF index: 1.2.1.1.3.2.3
created: 2023-03-14
comment: The maximum magnetic field limits allowed for axle counters (in dBµA/m) for a defined frequency band. Direction X.
term status: stable

Maximum magnetic field direction Y
type: DatatypeProperty
domain: Maximum magnetic field
range: integer
RINF index: 1.1.1.3.4.2.3
RINF index: 1.2.1.1.3.2.3
created: 2023-03-14
comment: The maximum magnetic field limits allowed for axle counters (in dBµA/m) for a defined frequency band. Direction Y.
term status: stable

Maximum magnetic field direction Z
type: DatatypeProperty
domain: Maximum magnetic field
range: integer
RINF index: 1.1.1.3.4.2.3
RINF index: 1.2.1.1.3.2.3
created: 2023-03-14
comment: The maximum magnetic field limits allowed for axle counters (in dBµA/m) for a defined frequency band. Direction Z.
term status: stable

Maximum permitted speed
type: DatatypeProperty
type: FunctionalProperty
domain: Class
  union of: Subset with common characteristics
  union of: Track
range: integer
XML name: IPP_MaxSpeed
Appendix D2 index: 3.1.4
RINF index: 1.1.1.1.2.5
used in RCC calculations: true
created: 2020-08-24
modified: 2023-03-14
comment: Nominal maximum operational speed on the line as a result of infrastructure, energy and control, command and signalling subsystem characteristics expressed in kilometres/hour. In https://eur-lex.europa.eu/eli/reg_impl/2019/773/oj 3.1.4 Maximum permissible speed for each track, including, if necessary, differential speeds relating to certain types of train.
term status: stable

Maximum service break
type: DatatypeProperty
type: FunctionalProperty
domain: Vehicle Type
range: string
ERATV index: 4.7.7
created: 2021-08-26
modified: 2021-08-26
comment: At maximum service brake: Stopping distance, Maximum deceleration, for the load condition 'design mass under normal payload' at the design maximum speed.
term status: stable

Maximum speed and cant deficiency
type: DatatypeProperty
type: FunctionalProperty
domain: Vehicle Type
range: string
ERATV index: 4.6.4
created: 2020-08-24
is replaced by: Maximum speed and cant deficiency
is replaced by: Vehicle type maximum cant deficiency
is replaced by: Vehicle type maximum speed
is replaced by: Vehicle type maximum speed and cant deficiency
modified: 2023-04-05
comment: Combination of maximum speed and maximum cant deficiency for which the vehicle was assessed. This property was before an object skos property. The values for this property do not come from a list of predefined values. Thus, the original object property was replaced by this datatype property with range xsd:string. Deprecated because of replacement by a class and two integer properties. The reason is that the property represents two concepts: [number] km/h for maximum speed - [number] mm for maximum cant deificency.
deprecated: true
term status: stable

Maximum speed empty
type: DatatypeProperty
domain: Vehicle Type
range: integer
ERATV index: 4.1.2.2
created: 2021-08-24
modified: 2021-08-24
comment: Maximum speed when empty.
term status: stable

Temperature range (maximum)
type: DatatypeProperty
domain: Class
  union of: Subset with common characteristics
  union of: Track
  union of: Vehicle Type
range: int
XML name: IPP_TempRange
ERATV index: 4.3.1
RINF index: 1.1.1.1.2.6
used in RCC calculations: true
created: 2020-08-24
modified: 2021-09-10
comment: Maximum tempertaure allowed for unrestricted operation access, according to European standard.
term status: stable

Maximum train deceleration
type: DatatypeProperty
type: FunctionalProperty
domain: Class
  union of: Subset with common characteristics
  union of: Track
range: double
XML name: ILR_MaxDeceleration
RINF index: 1.1.1.1.6.1
used in RCC calculations: true
created: 2020-08-24
modified: 2021-09-10
comment: Limit for longitudinal track resistance given as a maximum allowed train deceleration and expressed in metres per square second.
term status: stable

Meets requirement vehicle authorization
type: DatatypeProperty
domain: Vehicle Type
range: string
ERATV index: 4.1.8
created: 2021-08-25
modified: 2021-08-25
comment: Type meets the requirements necessary for validity of the vehicle authorisation granted by one Member State in other MSs.
term status: stable

Minimum permitted axle load
type: DatatypeProperty
type: FunctionalProperty
domain: Class
  union of: Min axle load vehicle category
  union of: Vehicle Type
range: double
XML name: CTD_MinAxleLoadByVehicleCat
ERATV index: 4.14.2.10
RINF index: 1.1.1.3.7.11.1
created: 2021-08-08
modified: 2023-03-14
comment: Minimum permitted axle load, given in tons.
comment: Should be deprecated according to the ammendment to the Regulation (EU) 2019/777 but remains because it is also a parameter of ERATV.
term status: stable

Minimum permitted distance between two consecutive axles
type: DatatypeProperty
domain: Vehicle Type
range: integer
XML name: CTD_MinDistConsecutiveAxles
ERATV index: 4.14.2.2
RINF index: 1.1.1.3.7.3
created: 2021-08-08
modified: 2023-03-14
comment: Deprecated according to the ammendment to the Regulation (EU) 2019/777. However, the parameter remains as it is also an ERATV parameter. RINF index has been deleted.
comment: Indication of minimum permitted distance between two consecutive axles, given in millimetres.
term status: stable

Minimum permitted distance between first and last axle
type: DatatypeProperty
domain: Vehicle Type
range: integer
XML name: CTD_MinDistFirstLastAxles
ERATV index: 4.14.2.3
RINF index: 1.1.1.3.7.4
created: 2021-08-08
modified: 2023-03-14
comment: Deprecated according to the ammendment to the Regulation (EU) 2019/777. However, the parameter remains as it is also an ERATV parameter. RINF index has been deleted
comment: Indication of minimum permitted distance between first and last axles, given in millimetres.
term status: stable

Minimum permitted height of the flange
type: DatatypeProperty
domain: Vehicle Type
range: double
XML name: CTD_MinFlangeHeight
ERATV index: 4.14.2.8
RINF index: 1.1.1.3.7.9
created: 2021-08-08
modified: 2021-09-01
comment: Deprecated according to the ammendment to the Regulation (EU) 2019/777. However, the parameter remains as it is also an ERATV parameter. RINF index has been deleted
comment: Minimum permitted flange height, given in millimiters.
term status: stable

Minimum permitted thickness of the flange
type: DatatypeProperty
domain: Vehicle Type
range: double
XML name: CTD_MinFlangeThickness
ERATV index: 4.14.2.7
RINF index: 1.1.1.3.7.8
created: 2021-08-08
modified: 2021-09-01
comment: Deprecated according to the ammendment to the Regulation (EU) 2019/777. However, the parameter remains as it is also an ERATV parameter. RINF index has been deleted
comment: Minimum permitted flange thickness, given in millimiters.
term status: stable

Minimum permitted width of the rim
type: DatatypeProperty
domain: Vehicle Type
range: double
XML name: CTD_MinRimWidth
ERATV index: 4.14.2.5
RINF index: 1.1.1.3.7.6
created: 2021-08-08
modified: 2023-03-14
comment: Deprecated according to the ammendment to the Regulation (EU) 2019/777. However, the parameter remains as it is also an ERATV parameter. RINF index has been deleted.
term status: stable

Vehicle impedance
type: DatatypeProperty
domain: Class
  union of: Train Detection System
  union of: Vehicle Type
range: string
ERATV index: 4.14.2.17
RINF index: 1.1.1.3.4.2.2
RINF index: 1.2.1.1.3.2.2
created: 2021-09-01
modified: 2023-03-14
comment: Impedance as defined in the specification referenced in Appendix A-1, index [D]. Impedance as defined in point 3.2.2.1 of ERA/ERTMS/033281 V5. Minimum vehicle impedance (between wheels and pantograph) (only for vehicles equipped for 1500V or 3000V DC).
term status: stable
alternative label: Minimum vehicle impedance

Minimum permitted wheel diameter
type: DatatypeProperty
domain: Vehicle Type
range: integer
XML name: CTD_MinWheelDiameter
ERATV index: 4.14.2.6
RINF index: 1.1.1.3.7.7
created: 2021-08-08
modified: 2023-03-14
comment: Deprecated according to the ammendment to the Regulation (EU) 2019/777. However, the parameter remains as it is also an ERATV parameter. RINF index has been deleted.
comment: Minimum permitted wheel diameter, given in millimiters.
term status: stable

Minimum concave vertical radius
type: DatatypeProperty
type: FunctionalProperty
domain: Vehicle Type
range: integer
ERATV index: 4.8.6
created: 2020-08-24
modified: 2020-11-03
comment: Minimum vertical concave curve radius capability.
term status: stable

Minimum contact wire height
type: DatatypeProperty
type: FunctionalProperty
domain: Class
  union of: Subset with common characteristics
  union of: Track
  union of: Vehicle Type
range: double
XML name: ECS_MinWireHeight
ERATV index: 4.10.5
RINF index: 1.1.1.2.2.6
used in RCC calculations: true
created: 2020-08-25
modified: 2021-09-11
comment: Indication of the minimum contact wire height expressed in metres.
term status: stable

Minimum convex vertical radius
type: DatatypeProperty
type: FunctionalProperty
domain: Vehicle Type
range: integer
ERATV index: 4.8.5
created: 2020-08-24
modified: 2020-11-03
comment: Minimum vertical convex curve radius capability.
term status: stable

Minimum radius of horizontal curve
type: DatatypeProperty
type: FunctionalProperty
domain: Class
  union of: Siding
  union of: Subset with common characteristics
  union of: Track
  union of: Vehicle Type
range: integer
XML name: ILL_MinRadHorzCurve
ERATV index: 4.8.4
RINF index: 1.1.1.1.3.7
RINF index: 1.2.2.0.3.2
used in RCC calculations: true
created: 2020-08-24
modified: 2021-09-10
comment: Radius of the smallest horizontal curve of the track in metres.
term status: stable

Temperature range (minimum)
type: DatatypeProperty
domain: Class
  union of: Subset with common characteristics
  union of: Track
  union of: Vehicle Type
range: int
XML name: IPP_TempRange
ERATV index: 4.3.1
RINF index: 1.1.1.1.2.6
used in RCC calculations: true
created: 2020-08-24
modified: 2021-09-10
comment: Minimum tempertaure allowed for unrestricted operation access, according to European standard.
term status: stable

Minimum radius of vertical curve
type: DatatypeProperty
type: FunctionalProperty
domain: Siding
range: string
XML name: ILL_MinRadVertCurve
RINF index: 1.2.2.0.3.3
created: 2020-08-24
is replaced by: Minimum radius of vertical curve crest
is replaced by: Minimum radius of vertical curve hollow
modified: 2023-04-05
comment: Radius of the smallest vertical curve expressed in metres. Deprecated because of replacement by two integer properties The reason is that the property is composed of two values: The first ‘NNN’ is a value of crest, the second ‘NNN’ is a value of hollow, both expressed in metres.
deprecated: true
term status: stable

Minimum radius of vertical curve crest
type: DatatypeProperty
domain: Siding
range: integer
XML name: ILL_MinRadVertCurve
RINF index: 1.2.2.0.3.3
used in RCC calculations: true
created: 2023-04-05
comment: Part of the minimum radius of vertical curve that indicates the crest. The minimum radius of vertical curve is the radius of the smallest vertical curve expressed in metres.
term status: stable

Minimum radius of vertical curve hollow
type: DatatypeProperty
domain: Siding
range: integer
XML name: ILL_MinRadVertCurve
RINF index: 1.2.2.0.3.3
used in RCC calculations: true
created: 2023-04-05
comment: Part of the minimum radius of vertical curve that indicates the hollow. The minimum radius of vertical curve is the radius of the smallest vertical curve expressed in metres.
term status: stable

Minimum wheel diameter for fixed obtuse crossings
type: DatatypeProperty
type: FunctionalProperty
domain: Class
  union of: Subset with common characteristics
  union of: Track
  union of: Vehicle Type
range: integer
XML name: ISC_MinWheelDiaFixObtuseCrossings
ERATV index: 4.8.2
RINF index: 1.1.1.1.5.2
used in RCC calculations: true
created: 2020-08-24
modified: 2021-09-10
comment: Maximum unguided length of fixed obtuse crossings is based on a minimum wheel diameter in service expressed in millimetres.
term status: stable

Need for more than one train protection, control and warning system required on board
type: DatatypeProperty
type: FunctionalProperty
domain: Class
  union of: Subset with common characteristics
  union of: Track
range: boolean
RINF index: 1.1.1.3.5.2
created: 2021-08-09
modified: 2023-03-14
comment: Deprecated according to the ammendment to the Regulation (EU) 2019/777. Indication whether more than one train protection, control and warning system is required to be on-board and active simultaneously.
deprecated: true
term status: unstable

National classification for load capability
type: DatatypeProperty
domain: Class
  union of: Subset with common characteristics
  union of: Track
range: string
XML name: IPP_NCLoadCap
RINF index: 1.1.1.1.2.4.1
used in RCC calculations: true
created: 2020-08-24
modified: 2021-09-10
comment: National classification for load capability.
term status: stable

National fire category of rolling stock required
type: DatatypeProperty
type: FunctionalProperty
domain: Tunnel
range: string
XML name: ITU_NatFireCatReq
RINF index: 1.1.1.1.8.11
RINF index: 1.2.1.0.5.8
RINF index: 1.2.2.0.5.8
used in RCC calculations: true
created: 2020-07-29
modified: 2021-08-10
comment: Categorisation how a passenger train with a fire on board will continue to operate for a defined time period — according to national rules if they exist
term status: stable

National Values used for the brake model
type: DatatypeProperty
domain: Class
  union of: Subset with common characteristics
  union of: Track
range: string
RINF index: 1.1.1.3.2.16.13
RINF index: 1.2.1.1.1.16.13
created: 2023-03-14
comment: Set of parameters for adapting the braking curves calculated by the ETCS on-board system to match accuracy, performance and safety margins imposed by the infrastructure manager. It copies the content of Packet 3 or of Packet 203 as defined in the specification referenced in Appendix A-1, index [C]. It copies the content of Packet 3 (for M_VERSION above 2.0) as defined in SRS 7.4.2.1.1 or of Packet 203 (for M_VERSION 1.1) , as defined in SRS 6.5.1.5.22,
term status: stable

Non coded restrictions
type: DatatypeProperty
type: FunctionalProperty
domain: Vehicle Type
range: string
created: 2022-06-15
modified: 2022-06-15
comment: Denotes a non coded restrictions for this particular vehicleType, as a set of sentences.
term status: stable

Number elements rake freight wagons
type: DatatypeProperty
domain: Vehicle Type
range: integer
ERATV index: 4.1.6
created: 2021-08-25
modified: 2021-08-25
comment: Number of elements in the rake of freight wagons (only for subcategory 'rake of freight wagons')
term status: stable

Number of pantographs in contact with OCL
type: DatatypeProperty
type: FunctionalProperty
domain: Vehicle Type
range: integer
ERATV index: 4.10.7
created: 2020-08-25
modified: 2020-11-19
comment: Number of pantographs in contact with the overhead contact line (OCL) (to be indicated for each energy supply system the vehicle is equipped for).
term status: stable

Number of toilets
type: DatatypeProperty
domain: Vehicle Type
range: integer
ERATV index: 4.12.1.2
created: 2021-08-31
modified: 2021-08-31
comment: Number of toilets.
term status: stable

Ocl type
type: DatatypeProperty
domain: Vehicle Type
range: string
ERATV index: 4.10.9
created: 2020-08-25
modified: 2020-10-03
comment: OCL type.
term status: stable

Name of Operational point
type: DatatypeProperty
type: FunctionalProperty
domain: Operational Point
range: string
XML name: OPName
Appendix D2 index: 2.3.1
RINF index: 1.2.0.0.0.1
created: 2021-09-13
modified: 2021-09-13
source: oj
comment: Name normally related to the town or village or to traffic control purpose. In https://eur-lex.europa.eu/eli/reg_impl/2019/773/oj 2.3.1 Name of location.
term status: stable

Type of track gauge changeover facility
type: DatatypeProperty
type: FunctionalProperty
domain: Operational Point
range: string
XML name: OPTypeGaugeChangeover
RINF index: 1.2.0.0.0.4.1
used in RCC calculations: true
created: 2021-08-11
modified: 2021-08-11
comment: Type of track gauge changeover facility.
term status: stable

Parking brake
type: DatatypeProperty
domain: Vehicle Type
range: boolean
ERATV index: 4.7.3
created: 2022-04-11
modified: 2022-04-11
comment: Indicates whether all vehicles of this type must be equipped with a parking brake.
term status: stable

Parking brake mandatory
type: DatatypeProperty
domain: Vehicle Type
range: boolean
ERATV index: 4.7.3.1
created: 2021-08-26
modified: 2021-08-26
comment: All vehicles of this type must be equipped with a parking brake (parking brake mandatory for vehicles of this type).
term status: stable

Parking brake maximum gradient
type: DatatypeProperty
type: FunctionalProperty
domain: Vehicle Type
range: double
ERATV index: 4.7.3.3
created: 2020-08-24
modified: 2020-11-03
comment: Maximum gradient on which the unit is kept immobilised by the parking brake alone (if the vehicle is fitted with it).
term status: stable

Pass-by noise level
type: DatatypeProperty
domain: Vehicle Type
range: double
ERATV index: 4.11.1
created: 2021-08-31
modified: 2021-08-31
comment: Pass-by noise level given in dB(A).
term status: stable

Permissible payload
type: DatatypeProperty
type: FunctionalProperty
domain: Vehicle Type
range: string
ERATV index: 4.5.1
created: 2020-08-24
modified: 2020-11-03
comment: Permissible payload for different line categories.
term status: stable

Permission for charging electric energy storage for traction purposes at standstill
type: DatatypeProperty
sub property of: topDataProperty
domain: Contact Line System
range: boolean
RINF index: 1.2.1.0.7.1
created: 2023-03-14
comment: Point at which IM authorises charging of electric energy storage for traction purposes at standstill.
term status: stable

Permit of use of reflective plates
type: DatatypeProperty
domain: Class
  union of: Subset with common characteristics
  union of: Track
range: boolean
RINF index: 1.1.1.1.7.12
created: 2023-03-14
comment: Sections where is permitted to use the reflective plates on rail freight corridors, with a view to prioritise the current bottlenecks. Specific case for Belgium, France, Italy, Portugal and Spain until 1.1.2026.
term status: stable

Contact force permitted
type: DatatypeProperty
type: FunctionalProperty
domain: Class
  union of: Subset with common characteristics
  union of: Track
range: string
XML name: ERS_ContactForce
RINF index: 1.1.1.2.5.2
used in RCC calculations: true
created: 2020-08-25
modified: 2021-09-12
comment: Indication of contact force allowed expressed in newtons.
term status: stable

Information on phase separation
type: DatatypeProperty
type: FunctionalProperty
domain: Class
  union of: Subset with common characteristics
  union of: Track
range: string
XML name: EOS_InfoPhase
RINF index: 1.1.1.2.4.1.2
created: 2021-08-08
is replaced by: Phase info length
is replaced by: Phase info pantograph lowered
is replaced by: Phase info switch off breaker
is replaced by: http://data.europa.eu/949/PhaseInfo
is replaced by: http://data.europa.eu/949/phaseInfoKm
is replaced by: http://data.europa.eu/949/trackPhaseInfo
modified: 2023-04-05
comment: Indication of required several information on phase separation. Deprecated because of replacement by three properties. The reason is that the property is composed of three values: length [NNN]’ – the length of the phase separation in metres; switch off breaker [Y/N], single selection of ‘Y=yes’ or ‘N=no’ to show whether the breaker has to be switched off; and lower pantograph [Y/N]’, single selection of ‘Y=yes’ or ‘N=no’ to show whether the pantograph has to be lowered, Km [NNN.NNN] - the location from the start of the line where the new value is valid.
deprecated: true
term status: stable

Phase info Km
type: DatatypeProperty
domain: Phase info
range: double
XML name: EOS_InfoPhase
RINF index: 1.1.1.2.4.1.2
creator: 2023-04-05
comment: Part of the phase info of a track that indicates the location from the start of the line where the new value is valid. The phase info is the indication of required several information on phase separation.
term status: stable

Phase info length
type: DatatypeProperty
domain: Phase info
range: integer
XML name: EOS_InfoPhase
RINF index: 1.1.1.2.4.1.2
created: 2023-04-05
comment: Part of the phase info of a track that corresponds to the length of the phase separation in metres. The phase info is the indication of required several information on phase separation.
term status: stable

Phase info pantograph lowered
type: DatatypeProperty
domain: Phase info
range: boolean
XML name: EOS_InfoPhase
RINF index: 1.1.1.2.4.1.2
created: 2023-04-05
comment: Part of the phase info of a track that shows whether a pantograph has to be lowered. The phase info is the indication of required several information on phase separation.
term status: stable

Phase info switch off breaker
type: DatatypeProperty
domain: Phase info
range: boolean
XML name: EOS_InfoPhase
RINF index: 1.1.1.2.4.1.2
created: 2023-04-05
comment: Part of the phase info of a track that shows whether the breaker has to be switched off. The phase info is the indication of required several information on phase separation.
term status: stable

Phase separation
type: DatatypeProperty
type: FunctionalProperty
domain: Class
  union of: Subset with common characteristics
  union of: Track
range: boolean
XML name: EOS_Phase
RINF index: 1.1.1.2.4.1.1
created: 2021-08-08
modified: 2021-09-12
comment: Indication of existence of phase separation and required information.
term status: stable

Platform id
type: DatatypeProperty
type: FunctionalProperty
domain: Platform
range: string
XML name: OPTrackPlatformIdentification
Appendix D2 index: 2.3.5
RINF index: 1.2.1.0.6.2
created: 2021-09-13
modified: 2023-03-14
source: oj
comment: Unique platform identification or platform number within an Operational Point. In 2.3.5 https://eur-lex.europa.eu/eli/reg_impl/2019/773/oj Identification of platforms.
term status: stable

Portable boarding aids
type: DatatypeProperty
domain: Vehicle Type
range: string
ERATV index: 4.12.3.3
created: 2021-08-31
modified: 2021-08-31
comment: Description of any portable boarding aids if considered in the design of the vehicle for meeting the PRM TSI requirements.
term status: stable

Prevent regenerative brake use
type: DatatypeProperty
type: FunctionalProperty
domain: Vehicle Type
range: boolean
ERATV index: 4.7.4.3.2
created: 2020-08-24
modified: 2020-11-03
comment: Possibility of preventing the use of the regenerative brake (only if fitted with regenerative brake).
term status: stable

Priority seats
type: DatatypeProperty
domain: Vehicle Type
range: string
ERATV index: 4.12.2.1
created: 2021-08-31
modified: 2021-08-31
comment: Number of priority seats.
term status: stable

Prm accessible toilets
type: DatatypeProperty
domain: Vehicle Type
range: integer
ERATV index: 4.12.2.3
created: 2021-08-31
modified: 2021-08-31
comment: Number of PRM accessible toilets.
term status: stable

GSM-R existence of roaming to public networks
type: DatatypeProperty
type: FunctionalProperty
domain: Class
  union of: Subset with common characteristics
  union of: Track
range: boolean
XML name: CRG_RoamingPublic
RINF index: 1.1.1.3.3.6
RINF index: 1.2.1.1.2.6
created: 2021-08-09
modified: 2021-09-12
comment: Existence of roaming to a public network In case of Y, provide the name of the public network under parameter 1.1.1.3.3.7.
term status: stable

GSM-R details on roaming to public networks
type: DatatypeProperty
type: FunctionalProperty
domain: Class
  union of: Subset with common characteristics
  union of: Track
range: string
XML name: CRG_RoamingPublicDetails
RINF index: 1.1.1.3.3.7
RINF index: 1.2.1.1.2.7
created: 2021-08-09
modified: 2023-04-05
comment: If roaming to public networks is configured, please indicate to which networks, for which users and in which areas.
deprecated: true
term status: stable

Q_NVSBTSMPERM
type: DatatypeProperty
domain: Class
  union of: Subset with common characteristics
  union of: Track
range: boolean
RINF index: 1.1.1.3.2.16.12
RINF index: 1.2.1.1.1.16.12
created: 2023-03-14
comment: Permission to use service brake in target speed monitoring.
term status: stable

Quasi static guiding force
type: DatatypeProperty
domain: Vehicle Type
range: double
ERATV index: 4.5.4
created: 2021-08-26
modified: 2021-08-26
comment: Quasi-static guiding force (if exceeds the limit defined in TSI or not defined in the TSI), given in kN.
term status: stable

Radio Network ID
type: DatatypeProperty
domain: Class
  union of: Subset with common characteristics
  union of: Track
range: integer
RINF index: 1.1.1.3.3.12
RINF index: 1.2.1.1.2.13
created: 2023-03-14
comment: Unique identification of the GSM-R network the calling mobile station has to register with, as defined in the specification referenced in Appendix A-1, index [C].
term status: stable

Radio switch over special conditions
type: DatatypeProperty
domain: Vehicle Type
range: string
ERATV index: 4.13.2.4
created: 2021-08-31
modified: 2021-08-31
comment: Special conditions implemented on-board to switch over between different radio systems. Given as combination of systems installed on board ('System XX'_'System YY').
term status: stable

Rail inclination measurement
type: DatatypeProperty
type: FunctionalProperty
domain: Class
  union of: Subset with common characteristics
  union of: Track
range: integer
RINF index: 1.1.1.1.4.3
created: 2022-09-06
description: http://data.europa.eu/949/railInclination
comment: An angle defining the inclination of the head of a rail relative to the running surface. This is a RINF parameter treated as an integer. It has been defined in order to distinguish it from the ERATV parameter, railInclination, which is a SKOS.
comment: The reason for deprecation is that the definition of this property is being rolled back, as before, the property railInclination is a SKOS for both RINF and ERATV.
deprecated: true
term status: stable

Rail system type
type: DatatypeProperty
domain: Subset with common characteristics
range: string
created: 2022-11-04
comment: Type of railway system. Can be "High-speed" or "Conventional".
term status: stable

Raised pantographs distance
type: DatatypeProperty
domain: Raised pantographs distance and speed
range: integer
XML name: EPA_NumRaisedSpeed
RINF index: 1.1.1.2.3.3
used in RCC calculations: true
created: 2023-04-05
comment: Part of the raised pantographs dustance and speed of a track that corresponds to the minimum distance between pantographs, in metres. The raised pantographs distance and speed is the indication of maximum number of raised pantographs per train allowed and minimum spacing centre line to centre line of adjacent pantograph heads, expressed in metres, at the given speed.
term status: stable

Requirements for number of raised pantographs and spacing between them, at the given speed
type: DatatypeProperty
domain: Class
  union of: Subset with common characteristics
  union of: Track
range: string
XML name: EPA_NumRaisedSpeed
Appendix D2 index: 3.3.4
RINF index: 1.1.1.2.3.3
created: 2020-08-25
modified: 2023-04-05
source: oj
comment: Indication of maximum number of raised pantographs per train allowed and minimum spacing centre line to centre line of adjacent pantograph heads, expressed in metres, at the given speed. In https://eur-lex.europa.eu/eli/reg_impl/2019/773/oj 3.3.4 Restriction related to the position of Multiple Traction unit(s) to comply with contact line separation (position of pantograph). Deprecated because of replacement by a class and three integer properties The reason is that the property is composed of three values: [N] is number of pantographs; [NNN] is minimum distance between pantographs, in metres; [NNN] is the speed considered in km/h.
deprecated: true
term status: stable

raisedPantographsNumber
type: DatatypeProperty
domain: Raised pantographs distance and speed
range: integer
XML name: EPA_NumRaisedSpeed
RINF index: 1.1.1.2.3.3
used in RCC calculations: true
created: 2023-04-05
comment: Number of pantographs.
label: Part of the raised pantographs distance and speed of a track that corresponds to the number of pantographs. The raised pantographs distance and speed is the indication of maximum number of raised pantographs per train allowed and minimum spacing centre line to centre line of adjacent pantograph heads, expressed in metres, at the given speed
term status: stable

Raised pantographs speed
type: DatatypeProperty
domain: Raised pantographs distance and speed
range: integer
XML name: EPA_NumRaisedSpeed
RINF index: 1.1.1.2.3.3
used in RCC calculations: true
created: 2023-04-05
comment: Part of the raised pantographs distance and speed of a track that corresponds to the speed considered in km/h. The raised pantographs distance and speed is the indication of maximum number of raised pantographs per train allowed and minimum spacing centre line to centre line of adjacent pantograph heads, expressed in metres, at the given speed
term status: stable

Steady red lights required
type: DatatypeProperty
type: FunctionalProperty
domain: Class
  union of: Subset with common characteristics
  union of: Track
range: boolean
XML name: IHS_RedLights
RINF index: 1.1.1.1.7.10
created: 2021-08-08
modified: 2021-09-12
comment: Sections where two steady red lights are required in accordance with OPE TSI
term status: stable

Reference pass-by noise level
type: DatatypeProperty
domain: Vehicle Type
range: boolean
ERATV index: 4.11.2
created: 2021-08-31
modified: 2021-08-31
comment: Pass-by noise level was measured under reference conditions.
term status: stable

Relative distance of the danger point
type: DatatypeProperty
domain: Signal
range: integer
RINF index: 1.1.1.3.14.4
RINF index: 1.2.1.0.8.4
created: 2023-03-14
comment: Distance in meters to the danger point.
term status: stable

Relative position
type: DatatypeProperty
range: double
created: 2021-04-01
modified: 2021-04-01
comment: Indicates the position of an object relative to the linear coordinates of the associated topological object.
term status: stable

Sanding override by driver required
type: DatatypeProperty
domain: Train Detection System
range: boolean
XML name: CTD_SandDriverOverride
Appendix D2 index: 3.2.6
RINF index: 1.1.1.3.7.18
created: 2021-08-08
modified: 2023-03-14
source: oj
comment: Deprecated according to the ammendment to the Regulation (EU) 2019/777. Indication whether possibility to activate/deactivate sanding devices by driver, according to instructions from the Infrastructure Manager, is required or not. In https://eur-lex.europa.eu/eli/reg_impl/2019/773/oj 3.2.6 Locations of areas designated for testing the sanding equipment (if existing).
deprecated: true
term status: stable

Schematic overview of the operational point
type: DatatypeProperty
domain: Operational Point
range: anyURI
RINF index: 1.2.0.0.0.7.1
created: 2023-03-14
comment: Document providing the schematic overview of the operational point.
term status: stable

Shortest distance between pantographs in contact with OCL
type: DatatypeProperty
type: FunctionalProperty
domain: Vehicle Type
range: string
ERATV index: 4.10.8
created: 2020-08-25
modified: 2021-09-15
comment: Shortest distance between two pantographs in contact with the OCL (to be indicated for each energy supply system the vehicle is equipped for; to be indicated for single and, if applicable, multiple operation) (only if number of raised pantographs is more than 1).
term status: stable

Identification of siding
type: DatatypeProperty
sub property of: identifier
type: FunctionalProperty
domain: Siding
range: string
XML name: OPSidingIdentification
Appendix D2 index: 2.2.1
Appendix D2 index: 2.2.1.4
RINF index: 1.2.2.0.0.2
created: 2021-09-13
modified: 2023-03-14
source: oj
comment: Unique siding identification or number within an Operational Point. IN https://eur-lex.europa.eu/eli/reg_impl/2019/773/oj 2.2.1 Indication of running lines, loops catch/trap points and access to sidings.
term status: stable

Name of signal
type: DatatypeProperty
sub property of: identifier
domain: Signal
range: string
RINF index: 1.1.1.3.14.1
RINF index: 1.2.1.0.8.1
created: 2023-03-14
comment: Identifier of signal
term status: stable

Sleeping places
type: DatatypeProperty
domain: Vehicle Type
range: string
ERATV index: 4.12.1.3
created: 2021-08-31
modified: 2021-09-15
comment: Number of sleeping places.
term status: stable

Specific information
type: DatatypeProperty
type: FunctionalProperty
domain: Class
  union of: Subset with common characteristics
  union of: Track
range: string
XML name: ILL_SpecificInfo
RINF index: 1.1.1.1.3.5.1
created: 2021-08-03
modified: 2021-09-10
comment: Any relevant information from the IM relating to the line layout.
term status: stable

Start intrinsic coordinate
type: DatatypeProperty
domain: Net Element
range: double
created: 2021-04-01
modified: 2021-04-01
comment: Indicates the coordinate point where a linear object begins.
term status: stable

Starting noise level
type: DatatypeProperty
domain: Vehicle Type
range: double
ERATV index: 4.11.4
created: 2021-08-31
modified: 2021-08-31
comment: starting noise level given in dB(A).
term status: stable

Static axle load under exceptional payload
type: DatatypeProperty
type: FunctionalProperty
domain: Vehicle Type
range: double
ERATV index: 4.5.3.3
created: 2020-08-24
modified: 2020-11-03
comment: Static axle load under exceptional payload.
term status: stable

Static axle load under normal payload
type: DatatypeProperty
type: FunctionalProperty
domain: Vehicle Type
range: double
ERATV index: 4.5.3.2
created: 2020-08-24
modified: 2020-11-03
comment: Static axle load under normal payload.
term status: stable

Static axle load in working order
type: DatatypeProperty
type: FunctionalProperty
domain: Vehicle Type
range: double
ERATV index: 4.5.3.1
created: 2020-08-24
modified: 2020-11-03
comment: Static axle load in working order.
term status: stable

Stationary noise level
type: DatatypeProperty
domain: Vehicle Type
range: double
ERATV index: 4.11.3
created: 2021-08-31
modified: 2021-08-31
comment: stationary noise level given in dB(A).
term status: stable

Structural category
type: DatatypeProperty
domain: Vehicle Type
range: string
ERATV index: 4.1.10
created: 2021-08-25
modified: 2021-08-25
comment: Structural category.
term status: stable

Railway location of structures requiring specific checks
type: DatatypeProperty
domain: Class
  union of: Subset with common characteristics
  union of: Track
range: double
XML name: IPP_StructureCheckLoc
RINF index: 1.1.1.1.2.4.3
used in RCC calculations: true
created: 2020-08-24
modified: 2023-03-14
comment: Localisation of structures requiring specific checks.
term status: stable

Name of a subset with common characteristics
type: DatatypeProperty
domain: Subset with common characteristics
range: string
created: 2023-03-14
comment: A subset of common characteristics is identified with a unique name/id, for example "ETCSbaseline2" which will describe all ETCS National values (1.1.1.3.2.16 group) and it will be the same for a part of the network (set of tracks).
term status: stable

Existence of switch over between different protection, control and warning systems while running
type: DatatypeProperty
type: FunctionalProperty
domain: Class
  union of: Subset with common characteristics
  union of: Track
range: boolean
XML name: CTS_SwitchProtectControlWarn
RINF index: 1.1.1.3.8.1
RINF index: 1.2.1.1.7.1
created: 2021-08-09
modified: 2021-09-12
comment: Indication whether a switch over between different systems whilst running exist.
term status: stable

Existence of switch over between different radio systems
type: DatatypeProperty
type: FunctionalProperty
domain: Class
  union of: Subset with common characteristics
  union of: Track
range: boolean
XML name: CTS_SwitchRadioSystem
RINF index: 1.1.1.3.8.2
RINF index: 1.2.1.1.7.2
created: 2021-08-09
modified: 2021-09-12
comment: Indication whether a switch over between different radio systems and no communication system whilst running exist.
term status: stable

Information on system separation
type: DatatypeProperty
type: FunctionalProperty
domain: Class
  union of: Subset with common characteristics
  union of: Track
range: string
XML name: EOS_InfoSystem
RINF index: 1.1.1.2.4.2.2
created: 2021-08-08
is replaced by: System separation info
is replaced by: System separation info Km
is replaced by: System separation info length
is replaced by: System separation info switch off breaker
is replaced by: systemSeparationLoweredPantograph
is replaced by: Track system separation info
modified: 2023-04-05
comment: Indication of required several information on system separation. Deprecated because of replacement by four properties. The reason is that the property is composed of four values: length [NNN], the length of the system separation in metres; switch off breaker [Y/N]. Single selection of ‘Y=yes’ or ‘N=no’ to show whether the breaker has to be switched off; lower pantograph [Y/N]. Single selection of ‘Y=yes’ or ‘N=no’ to show whether the pantograph has to be lowered, and [CharacterString] to show whether the supply system has to be changed.
deprecated: true
term status: stable

System separation info change supply system
type: DatatypeProperty
domain: System separation info
range: string
XML name: EOS_InfoSystem
RINF index: 1.1.1.2.4.2.2
created: 2023-04-05
comment: Part of the system separation info of a track that shows whether the supply system has to be changed. The system separation info is the Indication of required several information on system separation.
term status: stable

System separation info Km
type: DatatypeProperty
domain: Phase info
range: double
XML name: EOS_InfoSystem
RINF index: 1.1.1.2.4.2.2
created: 2023-04-05
comment: Part of the system separation info of a track. Indicates the the location from the start of the line where the new value is valid. The system separation info is the Indication of required several information on system separation.
term status: stable

System separation info length
type: DatatypeProperty
domain: System separation info
range: integer
XML name: EOS_InfoSystem
RINF index: 1.1.1.2.4.2.2
created: 2023-04-05
comment: Part of the system separation info of a track that shows the length of the system separation in metres. The system separation info is the Indication of required several information on system separation.
term status: stable

System separation info pantograph lowered
type: DatatypeProperty
domain: System separation info
range: boolean
XML name: EOS_InfoSystem
RINF index: 1.1.1.2.4.2.2
created: 2023-04-05
comment: Part of the system separation info of a track that shows whether the pantograph has to be lowered. The system separation info is the Indication of required several information on system separation.
term status: stable

System separation info switch off breaker
type: DatatypeProperty
domain: System separation info
range: boolean
XML name: EOS_InfoSystem
RINF index: 1.1.1.2.4.2.2
created: 2023-04-05
comment: Part of the system separation info of a track that shows whether the breaker has to be switched off. The system separation info is the Indication of required several information on system separation.
term status: stable

T_NVCONTACT
type: DatatypeProperty
domain: Class
  union of: Subset with common characteristics
  union of: Track
range: integer
Appendix D3 index: 1.5.8
RINF index: 1.1.1.3.2.16.8
RINF index: 1.2.1.1.1.16.8
created: 2022-11-07
modified: 2023-03-14
comment: Maximum time without a safe message from Radio Block Center before train reacts in seconds. According the specification referenced in Appendix A-1, index [C]. In https://www.era.europa.eu/sites/default/files/filesystem/ertms/ccs_tsi_annex_a_-_mandatory_specifications/set_of_specifications_3_etcs_b3_r2_gsm-r_b1/index004_-_subset-026_v360.zip Subset 26, chapter 7. 7.5.1.148 T_NVCONTACT.
term status: stable

T_NVOVTRP
type: DatatypeProperty
domain: Class
  union of: Subset with common characteristics
  union of: Track
range: integer
Appendix D3 index: 1.5.6
RINF index: 1.1.1.3.2.16.6
RINF index: 1.2.1.1.1.16.6
created: 2022-11-07
modified: 2023-03-14
comment: MMaximum time for overriding the train trip in seconds. According to the specification referenced in Appendix A-1, index [C]. In https://www.era.europa.eu/sites/default/files/filesystem/ertms/ccs_tsi_annex_a_-_mandatory_specifications/set_of_specifications_3_etcs_b3_r2_gsm-r_b1/index004_-_subset-026_v360.zip Subset 26, chapter 7. 7.5.1.149 T_NVOVTRP.
term status: stable

Primary location code developed for information exchange in accordance with the TSIs relating to telematics applications.
type: DatatypeProperty
sub property of: identifier
type: FunctionalProperty
domain: Operational Point
range: string
XML name: OPTafTapCode
Appendix D2 index: 2.2.2
RINF index: 1.2.0.0.0.3
created: 2020-07-29
modified: 2021-08-11
comment: Primary code developed for TAF/TAP.
term status: stable

TEN GIS identity
type: DatatypeProperty
type: FunctionalProperty
domain: Class
  union of: Subset with common characteristics
  union of: Track
range: string
XML name: IPP_TENGISID
RINF index: 1.1.1.1.2.1.2
created: 2021-08-03
modified: 2021-09-10
comment: Indication of the GIS identity (GIS ID) of the section of TEN-T database to which the track belongs.
term status: stable

Thermal capacity distance
type: DatatypeProperty
type: FunctionalProperty
domain: Vehicle Type
range: double
ERATV index: 4.7.2.1.4
created: 2020-08-24
modified: 2020-11-03
comment: Thermal capacity distance. If no reference case is indicated.
term status: stable

Thermal capacity gradient
type: DatatypeProperty
type: FunctionalProperty
domain: Vehicle Type
range: double
ERATV index: 4.7.2.1.3
created: 2020-08-24
modified: 2020-11-03
comment: Thermal capacity gradient. If no reference case is indicated.
term status: stable

Thermal capacity speed
type: DatatypeProperty
type: FunctionalProperty
domain: Vehicle Type
range: double
ERATV index: 4.7.2.1.2
created: 2020-08-24
modified: 2020-11-03
comment: Thermal capacity speed. If no reference case is indicated.
term status: stable

Thermal capacity time
type: DatatypeProperty
type: FunctionalProperty
domain: Vehicle Type
range: integer
ERATV index: 4.7.2.1.5
created: 2020-08-24
modified: 2020-11-03
comment: Thermal capacity time. If no reference case is indicated.
term status: stable

Indication whether tilting functions are supported by ETCS
type: DatatypeProperty
domain: Class
  union of: Subset with common characteristics
  union of: Track
range: boolean
RINF index: 1.1.1.3.12.1
created: 2021-08-09
modified: 2023-03-14
comment: Deprecated according to the ammendment to the Regulation (EU) 2019/777. Indication whether tilting functions are supported by ETCS.
deprecated: true
term status: stable

Total vehicle mass
type: DatatypeProperty
type: FunctionalProperty
domain: Vehicle Type
range: integer
ERATV index: 4.5.5
created: 2021-08-26
modified: 2021-08-26
comment: Total vehicle mass (for each vehicle of the unit), given in kg.
term status: stable

Identification of track
type: DatatypeProperty
sub property of: identifier
type: FunctionalProperty
domain: Track
range: string
XML name: OPTrackIdentification
XML name: SOLTrackIdentification
Appendix D2 index: 2.2.1.1
RINF index: 1.1.1.0.0.1
RINF index: 1.2.1.0.0.2
created: 2021-09-09
modified: 2021-09-09
source: oj
comment: Unique track identification or unique track number within a Section of Line. In https://eur-lex.europa.eu/eli/reg_impl/2019/773/oj 2.2.1 Indication of running lines, loops catch/trap points and access to sidings, 2.3.4 Identification and plan of tracks, including switches, 2.3.9 Identification of loops.
term status: stable

Train control switch over special conditions
type: DatatypeProperty
domain: Vehicle Type
range: string
ERATV index: 4.13.1.6
created: 2021-08-31
modified: 2021-08-31
comment: Special conditions implemented on-board to switch over between different train protection control and warning systems. Given as combination of systems installed on board ('System XX'_'System YY').
term status: stable

Document with the procedure(s) related to the type of train detection systems declared in 1.2.1.1.6.1
type: DatatypeProperty
domain: Train Detection System
range: anyURI
XML name: CTD_TCCheckDocRef
RINF index: 1.1.1.3.7.1.3
RINF index: 1.2.1.1.6.2
used in RCC calculations: true
created: 2021-08-03
modified: 2022-12-13
comment: Electronic document from the IM stored by the Agency with precise values in accordance with TSI CCS Article13 and the specification referenced in Appendix A-1, index [D], for the specific check to be performed for train detection systems identified in 1.1.1.3.7.1.2. and 1.2.1.1.6.1
term status: stable

Train integrity confirmation from on-board (not from driver) necessary for line access
type: DatatypeProperty
type: FunctionalProperty
domain: Class
  union of: Subset with common characteristics
  union of: Track
range: boolean
XML name: CPE_IntegrityConfirmation
RINF index: 1.1.1.3.2.8
RINF index: 1.2.1.1.1.8
used in RCC calculations: true
created: 2020-08-31
modified: 2021-09-12
comment: Indication whether train confirmation from on-board is required to access the line for safety reasons.
term status: stable

Transportable on ferry
type: DatatypeProperty
domain: Vehicle Type
range: boolean
ERATV index: 4.8.8
created: 2021-08-31
modified: 2021-08-31
comment: Indicates the suitability for transport on ferries.
term status: stable

Tsi compliant
type: DatatypeProperty
range: boolean
created: 2020-11-03
modified: 2023-01-23
comment: Indicates if a certain property is TSI compliant.
comment: The reason for deprecation is that it is used in SKOS "OtherPantographHeads" and "TsiPantographHeads" to indicate in the first case if a SKOS concept is not tsiCompliant (false) and in the second case that the concept is tsiCompliant (true). These two SKOS were originally one SKOS, "PantographHeads". Currently with the two SKOS the property is redundant.
deprecated: true
term status: stable

TSI compliance of in service values for switches and crossings
type: DatatypeProperty
type: FunctionalProperty
domain: Class
  union of: Subset with common characteristics
  union of: Track
range: boolean
XML name: ISC_TSISwitchCrossing
RINF index: 1.1.1.1.5.1
created: 2021-08-03
modified: 2021-09-10
comment: Switches and crossings are maintained to in service limit dimension as specified in TSI.
term status: stable

Reference to a document available from the IM with precise description of the tunnel
type: DatatypeProperty
domain: Tunnel
range: anyURI
XML name: ITU_TunnelDocRef
RINF index: 1.1.1.1.8.8.2
created: 2021-08-03
modified: 2021-08-03
comment: Electronic document available from the IM stored by the Agency with precise description of the clearance gauge and geometry of the tunnel.
term status: stable

Tunnel identification
type: DatatypeProperty
sub property of: identifier
type: FunctionalProperty
domain: Tunnel
range: string
XML name: OPSidingTunnelIdentification
XML name: OPTrackTunnelIdentification
XML name: SOLTunnelIdentification
Appendix D2 index: 3.2.3
RINF index: 1.1.1.1.8.2
RINF index: 1.2.1.0.5.2
RINF index: 1.2.2.0.5.2
created: 2021-08-03
modified: 2021-09-13
source: oj
comment: Unique tunnel identification or unique number within Member State. In https://eur-lex.europa.eu/eli/reg_impl/2019/773/oj 3.2.3 Tunnels: location, name, length, specific information such as the existence of walkways and points of safe egress as well as the location of safe areas where evacuation of passengers may take place; fire safety categorisation.
term status: stable

Tunnel kilometer end
type: DatatypeProperty
domain: Tunnel
range: double
XML name: SOLTunnelEnd
RINF index: 1.1.1.1.8.4
created: 2023-03-14
comment: Kilometer of the line at the end of a tunnel.
term status: stable

Tunnel kilometer start
type: DatatypeProperty
domain: Tunnel
range: double
XML name: SOLTunnelStart
RINF index: 1.1.1.1.8.3
created: 2023-03-14
comment: Geographical coordinates in decimal degrees and km of the line at the beginning of a tunnel.
term status: stable

Type version number
type: DatatypeProperty
type: FunctionalProperty
domain: Vehicle Type
range: string
created: 2020-11-22
modified: 2020-11-22
comment: Serial number that identifies a vehicle type.
term status: stable

Umax2 for lines referred to in sections 7.4.2.2.1 and 7.4.2.11.1 of Regulation (EU)1301/2014.
type: DatatypeProperty
domain: Contact Line System
range: integer
XML name: ECS_Umax2
RINF index: 1.1.1.2.2.1.3
used in RCC calculations: true
created: 2020-08-24
modified: 2021-08-06
comment: Highest non-permanent voltage (Umax2) for France on lines not compliant with values defined in the the specification referenced in Appendix A-2, index [1].
term status: stable

Unique OP ID
type: DatatypeProperty
sub property of: identifier
type: FunctionalProperty
domain: Operational Point
range: string
XML name: UniqueOPID
Appendix D2 index: 2.2.2
RINF index: 1.2.0.0.0.2
created: 2020-07-29
modified: 2021-08-11
source: oj
comment: Code composed of country code and alphanumeric operational point code, as defined in RINF. In https://eur-lex.europa.eu/eli/reg_impl/2019/773/oj 2.2.2 Principal locations (stations, yards, junctions, freight terminals) and their position relative to the line.
term status: stable

GSM-R use of group 555
type: DatatypeProperty
type: FunctionalProperty
domain: Class
  union of: Subset with common characteristics
  union of: Track
  union of: Vehicle Type
range: boolean
XML name: CRG_Needof555
ERATV index: 4.13.2.12
RINF index: 1.1.1.3.3.4
RINF index: 1.2.1.1.2.4
used in RCC calculations: true
created: 2020-08-31
modified: 2021-09-12
comment: Indication if group 555 is used.
term status: stable

V_NVALLOWOVTRP
type: DatatypeProperty
domain: Class
  union of: Subset with common characteristics
  union of: Track
range: integer
Appendix D3 index: 1.5.3
RINF index: 1.1.1.3.2.16.3
RINF index: 1.2.1.1.1.16.3
created: 2022-11-07
modified: 2023-03-14
comment: Speed limit allowing the driver to select the “override” function in km/h According to the specification referenced in Appendix A-1, index [C]. In https://www.era.europa.eu/sites/default/files/filesystem/ertms/ccs_tsi_annex_a_-_mandatory_specifications/set_of_specifications_3_etcs_b3_r2_gsm-r_b1/index004_-_subset-026_v360.zip Chapter 7. 7.5.1.161
term status: stable

V_NVSUPOVTRP
type: DatatypeProperty
domain: Class
  union of: Subset with common characteristics
  union of: Track
range: integer
Appendix D3 index: 1.5.4
RINF index: 1.1.1.3.2.16.4
RINF index: 1.2.1.1.1.16.4
created: 2022-11-07
modified: 2023-03-14
comment: Override speed limit to be supervised when the “override” function is active in km/h According to the specification referenced in Appendix A-1, index [C]. In https://www.era.europa.eu/sites/default/files/filesystem/ertms/ccs_tsi_annex_a_-_mandatory_specifications/set_of_specifications_3_etcs_b3_r2_gsm-r_b1/index004_-_subset-026_v360.zip Subset 26, chapter 7. 7.5.1.163 V_NVSUPOVTRP.
term status: stable

Validity end date
type: DatatypeProperty
domain: Infrastructure object
range: date
created: 2022-10-19
comment: Defines the validity end date (e.g., an operational point that is not valid anymore), so that it is possible to filter out those that are not applicable for a specific application (e.g., for route planning)
term status: stable

Validity start date
type: DatatypeProperty
domain: Infrastructure object
range: date
created: 2022-10-20
comment: Defines the validity start date (e.g., an operational point that is not valid now since it is planned for the future), so that it is possible to filter out those that are not applicable for a specific application (e.g., for route planning)
term status: stable

Vehicle contact force
type: DatatypeProperty
type: FunctionalProperty
domain: Vehicle Type
range: integer
ERATV index: 4.10.15
created: 2020-08-25
modified: 2020-11-03
comment: Mean contact force.
term status: stable

Vehicle kinematic gauge other
type: DatatypeProperty
domain: Vehicle Type
range: string
ERATV index: 4.2.2
created: 2022-05-30
comment: Vehicle kinematic gauge that corresponds to other gauges assessed using the kinematic method
term status: stable

Vehicle max sanding output
type: DatatypeProperty
domain: Vehicle Type
range: string
ERATV index: 4.14.2.13
created: 2021-09-01
modified: 2021-09-01
comment: Vehicle Maximum sanding output, given in grams per second.
term status: stable

Vehicle number
type: DatatypeProperty
domain: Vehicle
range: string
created: 2020-11-24
modified: 2020-11-24
comment: Identification number of a vehicle or wagon.
term status: stable

Vehicle pantograph head
type: DatatypeProperty
domain: Vehicle Type
range: string
ERATV index: 4.10.6
created: 2020-08-25
modified: 2020-11-03
comment: Pantograph head geometry (to be indicated for each energy supply system the vehicle is equipped for).
term status: stable

Vehicle series
type: DatatypeProperty
domain: Vehicle
range: string
created: 2020-11-22
modified: 2020-11-22
comment: Manufacturing series of a vehicle.
term status: unstable

Vehicle type maximum cant deficiency
type: DatatypeProperty
domain: Maximum speed and cant deficiency
range: integer
ERATV index: 4.6.4
created: 2023-04-05
comment: Part of the combination of maximum speed and maximum cant deficiency for which the vehicle was assessed. Corresponds to the maximum cant deficiency.
term status: stable

Vehicle type maximum speed
type: DatatypeProperty
domain: Maximum speed and cant deficiency
range: integer
ERATV index: 4.6.4
created: 2023-04-05
comment: Part of the combination of maximum speed and maximum cant deficiency for which the vehicle was assessed. Corresponds to the maximum speed.
term status: stable

List of vehicle types already identified as compatible with Traffic load and load carrying capacity of infrastructure and train detection systems
type: DatatypeProperty
domain: Class
  union of: Subset with common characteristics
  union of: Track
range: anyURI
RINF index: 1.1.1.5.1
created: 2023-03-14
comment: The infrastructure managers shall provide through RINF the information to the RU regarding list of vehicle types compatible with the route for which they have already verified compatibility for parameter Traffic load and load carrying capacity of infrastructure and train detection systems, where such information is available.
term status: unstable

List of vehicles already identified as compatible with Traffic load and load carrying capacity of infrastructure and train detection systems
type: DatatypeProperty
domain: Class
  union of: Subset with common characteristics
  union of: Track
range: anyURI
RINF index: 1.1.1.5.2
created: 2023-03-14
comment: The infrastructure managers shall provide through RINF the information or a document to the RU regarding list of vehicle(s) compatible with the route for which they have already verified compatibility for parameter Traffic load and load carrying capacity of infrastructure and train detection systems, where such information is available.
term status: unstable

Vehicles composing fixed formation
type: DatatypeProperty
type: FunctionalProperty
domain: Vehicle Type
range: integer
ERATV index: 4.1.12
created: 2021-08-25
modified: 2021-08-25
comment: Number of vehicles composing the fixed formation (for fixed formation only). Note: the value is mandatory for all vehicle categories. If the vehicle is composed of only one car, the indicated value shall be '1'.
term status: stable

EC declaration of verification for track (CCS)
type: DatatypeProperty
domain: Class
  union of: Subset with common characteristics
  union of: Track
range: string
XML name: CDE_ECVerification
RINF index: 1.1.1.3.1.1
created: 2021-08-08
modified: 2022-07-28
comment: Unique number for EC declarations in accordance with Commission Implementing Regulation (EU) 2019/250
term status: stable

EC declaration of verification for track (ENE)
type: DatatypeProperty
domain: Class
  union of: Subset with common characteristics
  union of: Track
range: string
XML name: EDE_ECVerification
RINF index: 1.1.1.2.1.1
created: 2021-08-08
modified: 2021-09-11
comment: Unique number for EC declarations in accordance with Commission Implementing Regulation (EU) 2019/250.
term status: stable

EC declaration of verification for track/siding [INF]
type: DatatypeProperty
domain: Class
  union of: Siding
  union of: Track
range: string
XML name: IDE_ECVerification
RINF index: 1.1.1.1.1.1
RINF index: 1.2.1.0.1.1
RINF index: 1.2.2.0.1.1
created: 2021-08-03
modified: 2023-03-14
comment: Unique number for EC declarations in accordance with Commission Implementing Regulation (EU) 2019/250. In https://eur-lex.europa.eu/legal-content/EN/TXT/HTML/?uri=CELEX:32019R0777&from=EN
term status: stable

EC declaration of verification for tunnel (SRT)
type: DatatypeProperty
domain: Tunnel
range: string
XML name: ITU_ECVerification
RINF index: 1.1.1.1.8.5
RINF index: 1.2.1.0.5.3
RINF index: 1.2.2.0.5.3
created: 2021-08-03
modified: 2021-09-02
comment: Unique number for EC declarations in accordance with Commission Implementing Regulation (EU) 2019/250.
term status: stable

Voice operational communication implementation
type: DatatypeProperty
type: FunctionalProperty
domain: Vehicle Type
range: string
ERATV index: 4.13.2.6
created: 2021-08-31
modified: 2021-08-31
comment: Voice and operational communication implementation.
term status: stable

Wheel set gauge transformation method
type: DatatypeProperty
domain: Vehicle Type
range: string
ERATV index: 4.1.3.b
created: 2021-08-25
modified: 2021-08-25
comment: Wheel gauge transformation method. Defined if more than one wheel gauges have been selected.
term status: stable

Wheelchair sleeping spaces
type: DatatypeProperty
domain: Vehicle Type
range: string
ERATV index: 4.12.2.4
created: 2021-08-31
modified: 2021-08-31
comment: Number of wheelchair accessible sleeping places.
term status: stable

Wheelchair spaces
type: DatatypeProperty
domain: Vehicle Type
range: integer
ERATV index: 4.12.2.2
created: 2021-08-31
modified: 2023-01-23
comment: Number of wheelchair spaces.
term status: stable

Border
type: Class
subclass of: Operational Point
modified: 2022-10-27
source: https://wiki3.railml.org/wiki/IS:border
comment: The reason for deprecation of the Border is that it has no usage and is already represented in the SKOS OperationalPointTypes. This concept was included as part of the LD4RAIL-242 Create functional prototype of the new vocabulary (D-B2-A2) issue, https://citnet.tech.ec.europa.eu/CITnet/confluence/pages/viewpage.action?pageId=1122974879.
deprecated: true
definition: A border point is used to separate the railway network due to different reasons. Typical examples are country borders, the change of owning infrastructure manager or the border of a station.

Certificate
type: Class
created: 2022-06-15
modified: 2022-06-15
term status: stable

Contact Line System
type: Class
RINF index: 1.1.1.2.2
created: 2021-08-04
modified: 2021-08-04
comment: System that is used to transmit electrical energy to road or rail vehicles.
term status: stable

ETCS Level
type: Class
RINF index: 1.1.1.3.2
created: 2021-08-07
modified: 2021-08-07
comment: ERTMS / ETCS application level related to the track side equipment.
term status: stable

ERA Feature
type: Class
subclass of: Feature
created: 2022-07-07
modified: 2022-10-27
comment: Class that encompasses the features that are part of the physical infrastructure (class InfrastructureObject) and the topological objects (class TopologicalObject). It is a subclass of the geographical Feature class that has a spatial representation.

Section with train detection limitation, only for the French network
type: Class
created: 2023-04-05
comment: Specific for route compatibility check on French network. Sections with: -1 Tonnage circulated per track is inferior to 15000 tons/day/track -2 Directional Interlocking -3 45-second delay for directional interlocking -4 Installation with track circuit announcement -5 Absence of a shunting assistance pedal in the normal direction of circulation for non-reversible double track lines -6 Absence of a shunting assistance pedal regardless of the direction of traffic for single track lines and tracks for two way working -7 Absence of a pedal announcement mechanism -8 45-second delay for specific announcement reset devices
term status: stable

Infrastructure manager
type: Class
subclass of: Organization
comment: The infrastructure manager owns and operates the railway network and related infrastructure.
scope note: See point (2) of Article 3 of Directive 2012/34/EU of the European Parliament and of the Council establishing a single European railway area.

Infrastructure object
type: Class
subclass of: ERA Feature
created: 2022-07-07
modified: 2022-10-27
comment: This class encompasses all those classes that represent features that are implemented in the European railway infrastructure. It is a subclass of the ERA Feature that has a spatial representation. It covers tracks, platforms, signals, tunnels, operational points, and sections of line. A feature that belongs to the infrastructure can be abstracted (hasAbstraction) as a topological object. It also is related to the infrastructure manager through the property infrastructureMgr.

Railway location
type: Class
created: 2021-01-29
modified: 2021-01-29
comment: A reference to a specific national railway line.
comment: Railway location
term status: stable
alternative label: Linear reference

Load capability
type: Class
created: 2023-03-14
comment: A combination of the line category and speed at the weakest point of the track. Each track can have several load capability (structured) values, and each one has values for load model line category and load model speed.
comment: This class together with properties loadCapabilityLineCategory and loadCapabilitySpeed replaces the previous loadCapability SKOS property.
term status: stable

Manufacturer
type: Class
subclass of: Organization
created: 2020-11-19
modified: 2020-11-19
comment: A company or organization that manufactures vehicles.
term status: stable

Maximum magnetic field
type: Class
created: 2023-03-14
comment: The maximum magnetic field limits allowed for axle counters (in dBµA/m) for a defined frequency band. It should be provided in 3 directions.
term status: stable

Maximum speed and cant deficiency
type: Class
created: 2023-04-05
comment: Combination of maximum speed and maximum cant deficiency for which the vehicle was assessed.
term status: stable

Min axle load vehicle category
type: Class
created: 2023-01-25
modified: 2023-03-14
comment: Deprecated according to the ammendment to the Regulation (EU) 2019/777. Represents information that indicates the load given in tons depending of the category of vehicle. Its properties are minAxleLoadVehicleCategory and minAxleLoad.
deprecated: true
term status: stable

National railway line
type: Class
created: 2021-01-25
modified: 2021-08-03
comment: Railway line within a member state.
term status: stable

Net Element
type: Class
subclass of: Topological Object
created: 2021-04-01
modified: 2021-04-01
comment: Base class for defining nodes in the connectivity graph representing the topological network.
term status: stable

Net Relation
type: Class
subclass of: Topological Object
created: 2021-04-01
modified: 2021-04-01
comment: Base class for defining edges in the connectivity graph representing the topological network.
term status: stable

Operational Point
type: Class
subclass of: Infrastructure object
Appendix D2 index: 2.1.2
RINF index: 1.2
created: 2020-07-29
modified: 2022-07-07
comment: An operational point (OP) means any location for train service operations, where train services may begin and end or change route, and where passenger or freight services may be provided; operational point also means any location at boundaries between Member States or infrastructure managers. In https://eur-lex.europa.eu/eli/reg_impl/2019/773/oj 2.1.2 Principal locations (stations, yards, junctions, freight terminals).
term status: stable

Phase info
type: Class
created: 2023-04-05
comment: Indication of required several information on phase separation.
term status: stable

Platform
type: Class
subclass of: Infrastructure object
RINF index: 1.2.1.0.6
created: 2021-08-02
modified: 2022-07-07
comment: Platform for the purpose of RINF is understood as a platform edge. A platform concerns only the part of the structure neighbouring to the track (interfaced with trains).
term status: stable

Raised pantographs distance and speed
type: Class
created: 2023-04-05
label: Indication of maximum number of raised pantographs per train allowed and minimum spacing centre line to centre line of adjacent pantograph heads, expressed in metres, at the given speed. Each track can have several raised pantographs per train allowed (structured) values, and each one has values for number of pantographs, minimum distance between pantographs, in metres, and speed considered in km/h.
term status: stable

Section Of Line
type: Class
subclass of: Infrastructure object
subclass of: Restriction
  on property: National line identification
  qualified cardinality: 1
  on class: National railway line
subclass of: Restriction
  on property: Operational Point at end of Section of Line
  qualified cardinality: 1
  on class: Operational Point
subclass of: Restriction
  on property: Operational Point at start of Section of Line
  qualified cardinality: 1
  on class: Operational Point
Appendix D2 index: 2.1.1
RINF index: 1.1
source: oj
created: 2021-04-02
modified: 2022-07-07
comment: A section of line means the part of line between adjacent operational points and may consist of several tracks. In https://eur-lex.europa.eu/eli/reg_impl/2019/773/oj 2.1.1 Line sections.
term status: stable

Siding
type: Class
subclass of: Track
RINF index: 1.2.2
created: 2021-08-10
modified: 2022-10-27
source: Official Journal of the European Union L 139 I/85
comment: Sidings are all those tracks where running trains in service movements ends and which are not used for operational routing of a train.
term status: stable
definition: Siding Any track(s) within an operational point which is not used for operational routing of a train.

Signal
type: Class
subclass of: Infrastructure object
RINF index: 1.2.1.0.8
source: oj
created: 2021-04-01
modified: 2022-10-27
comment: A railway signal is an installation next to the railway track for signalling the maximum allowed speed in the next block section to the train driver. Definition RSM: Apparatus by means of which a conventional visual or acoustic indication is given, generally concerning the movements of railway vehicles.
term status: stable

Special area
type: Class
subclass of: Infrastructure object
source: oj
created: 2022-10-27
comment: Encompasses all those areas or sections such as safe areas, restricted areas (non-stopping areas or industrial risk locations).
term status: stable

Special tunnel area
type: Class
subclass of: Special area
source: oj
created: 2022-10-27
comment: Area or location within a tunnel where there is a walkway, evacuation and rescue points.
term status: stable

Subset with common characteristics
type: Class
created: 2022-11-04
modified: 2023-03-14
comment: Subset of items shared by sections of lines and/or operational points of a member state. For the purposes of the register of infrastructure, each infrastructure manager shall describe its railway network at least by sections of line and operational points and optionally via common characteristic subsets.
term status: stable

System separation info
type: Class
created: 2023-04-05
comment: Indication of required several information on system separation.
term status: stable

Topological Object
type: Class
subclass of: ERA Feature
created: 2022-05-04
comment: Top level class for the the track network described as a topological node edge model
term status: unstable

Track
type: Class
subclass of: Infrastructure object
RINF index: 1.1.1
created: 2020-07-29
modified: 2022-07-07
comment: A running track that is used for train service movements.
term status: stable

Train Detection System
type: Class
RINF index: 1.1.1.3.4
created: 2021-08-07
modified: 2021-08-07
comment: System used to detect the position of vehicles in the railway track.
term status: stable

Tunnel
type: Class
subclass of: Infrastructure object
RINF index: 1.2.2.0.5
source: oj
created: 2020-07-29
modified: 2022-07-07
comment: A railway tunnel is an excavation or a construction around the track provided to allow the railway to pass for example higher land, buildings or water.
term status: stable

Vehicle
type: Class
created: 2020-11-22
modified: 2020-11-22
comment: A specific vehicle or wagon able to operate over railway lines.
term status: stable

Vehicle Keeper
type: Class
subclass of: Organization
created: 2020-11-23
modified: 2020-11-23
comment: A company or organization that owns or operates a certain vehicle.
term status: stable

Vehicle Type
type: Class
subclass of: Restriction
  on property: Manufacturer
  qualified cardinality: 1
  on class: Manufacturer
created: 2020-07-29
modified: 2020-07-29
comment: A vehicle type that has been authorized to operate on the EU railway infrastructure.
term status: stable

Point
type: Class
subclass of: SpatialThing
comment: Uniquely identified by lat/long/alt. i.e. spaciallyIntersects(P1, P2) :- lat(P1, LAT), long(P1, LONG), alt(P1, ALT), lat(P2, LAT), long(P2, LONG), alt(P2, ALT). sameThing(P1, P2) :- type(P1, Point), type(P2, Point), spaciallyIntersects(P1, P2).
comment: A point, typically described using a coordinate system relative to Earth, such as WGS84.

SpatialThing
type: Class
comment: Anything with spatial extent, i.e. size, shape, or position. e.g. people, places, bowling balls, as well as abstract areas like cubes.

asWKT
XML name: OPGeographicLocation
Appendix D2 index: 2.1.1
Appendix D2 index: 2.1.2
Appendix D2 index: 2.2.2
RINF index: 1.1.0.0.1.1
RINF index: 1.1.1.0.1.1
RINF index: 1.1.1.3.14.6
RINF index: 1.2.0.0.0.5
RINF index: 1.2.1.0.8.5

WGS84 Geo Positioning: an RDF vocabulary
date: $Date: 2009/04/20 15:00:30 $
description: A vocabulary for representing latitude, longitude and altitude information in the WGS84 geodetic reference datum. Version $Id: wgs84_pos.rdf,v 1.22 2009/04/20 15:00:30 timbl Exp $. See http://www.w3.org/2003/01/geo/ for more details.
comment: Recent changes to this namespace: $Log: wgs84_pos.rdf,v $ Revision 1.22 2009/04/20 15:00:30 timbl Remove the time bits which have been deal with elsewhere eg in iCal. Revision 1.21 2009/04/20 12:52:47 timbl try again Revision 1.20 2009/04/20 12:42:11 timbl Add Event (edited ages ago and never checked in), and location (following discussion http://chatlogs.planetrdf.com/swig/2009-04-20#T12-36-09) Revision 1.19 2009/04/20 12:36:31 timbl Add Event (edited ages ago and never checked in), and location (following discussion http://chatlogs.planetrdf.com/swig/2009-04-20#T12-36-09) Revision 1.18 2006/02/01 22:01:04 danbri Clarified that lat and long are decimal degrees, and that alt is decimal metres about local reference ellipsoid Revision 1.17 2004/02/06 17:38:12 danbri Fixed a bad commit screwup Revision 1.15 2003/04/19 11:24:08 danbri Fixed the typo even more. Revision 1.14 2003/04/19 11:16:56 danbri fixed a typo Revision 1.13 2003/02/19 22:27:27 connolly relaxed domain constraints on lat/long/alt from Point to SpatialThing Revision 1.12 2003/01/12 01:41:41 danbri Trying local copy of XSLT doc. Revision 1.11 2003/01/12 01:20:18 danbri added a link to morten's xslt rdfs viewer. Revision 1.10 2003/01/11 18:56:49 danbri Removed datatype range from lat and long properties, since they would have required each occurance of the property to mention the datatype. Revision 1.9 2003/01/11 11:41:31 danbri Another typo; repaired rdfs:Property to rdf:Property x4 Revision 1.8 2003/01/11 11:05:02 danbri Added an rdfs:range for each lat/long/alt property, http://www.w3.org/2001/XMLSchema#float Revision 1.7 2003/01/10 20:25:16 danbri Longer rdfs:comment for Point, trying to be Earth-centric and neutral about coordinate system(s) at the same time. Feedback welcomed. Revision 1.6 2003/01/10 20:18:30 danbri Added CVS log comments into the RDF/XML as an rdfs:comment property of the vocabulary. Note that this is not common practice (but seems both harmless and potentially useful). revision 1.…
label: geo

Lat/long
comment: A comma-separated representation of a latitude, longitude coordinate.